{"text_format":"1","workbook":"xlsx","n_sheets":17,"sheets":["Opciones","Datos_Generales","Resumen","Descripción","Objetivos","Metodología","Estado_del_Arte","Marco_Teorico","Cronograma","PD","Integrantes","Presupuesto","Impactos","Grupo","Biblografia","Imagenes","Normas"],"not_rendered":{"charts":0,"images":3,"macros":0,"external_links":0,"defined_names":69,"comments":14,"pivot_tables":0},"unopened":[],"bounds":{"document_bytes":16777216,"sheet_cells":100000,"rows_first":2000,"rows_last":500,"rows_between":2000,"halvings":0,"cell_chars":16384,"cell_head_chars":4096},"cells_cut":0,"cells_raw":0,"read":"whole","date_system":"1900"}

{"sheet":"Opciones","index":0,"n_rows":310,"n_cols":73,"rows_kept":310,"cut":false,"hidden":true,"merged":[]}
[null,"No ","Min Pts","Max Pts","Valor en Millones","Abreviatura","Clasificación","Tipo de Entidad","Tipo 2","SIoNo","Convocatoria","IDPRY","Tiempo","Max Presu","Tipo de Impacto","SEDES","Tipo de Proyecto:","Tipos de Productos ","Facultad","Nivel Estudios","Vinculo con la UMNG","FuncionProyecto","Tipo De Impacto","NBC","ID NBC",null,null,null,null,null,null,null,null,null,null,null,null,null,null,null,null,null,"http://scienti.colciencias.gov.co:8080/gruplac/jsp/visualiza/visualizagr.jsp?nro="]
[null,1,20,39.9,25,"Articulo Q1","A1","Institución Pública","Centro de investigacion ","Si","Proyecto de Iniciación Cientifica PIC","PIC",5,1,"Ambiental","Bogotá","Investigación Básica","Generación ","Ciencias Básicas y Aplicadas","Técnico ","Doc. Carrera TC","Investigador Principal","Ambiental","Programas y certificaciones básicas",11,null,null,null,null,null,null,null,null,null,null,null,null,null,null,null,null,null,null,null,null,"BB",null,{"$f":"MIN(BD3:BD298)","v":4},{"$f":"MAX(BD3:BD298)","v":298},null,null,null,null,null,null,null,null,null,null,null,null,null,null,null,null,null,null,null,null,null,null,"Clave","VICEINUMNG2014"]
[null,2,40,59.9,50,"Articulo Q2","B","Institución Privada","Centro de desarrollo tecnológico","No","Proyecto de Investigación Científica","INV",12,60,"Salud Humana","Campus Nueva Granada","Investigación Aplicada","Fortalecimiento","Derecho","Pregrado","Doc. Carrera MT","Coinvestigador ","Competividad","Alfabetización y aritmética elemental",21,null,null,null,null,null,null,null,null,null,null,null,null,null,null,"Hoja","FAC","Grupo","COD","Clas","Link","Lineas","Fila Grupo","Min","Max","FAC",null,null,"COD","Linea","Cel","Fila","E:Gp",null,"Código de Grupo"]
[null,3,60,79.900000000000006,75,"Articulo A1","C","Sector Defensa",null,null,"Proyecto de Alto Impacto","IMP",24,200,"Seres Vivos",null,"Desarrollo Tecnológico o Experimental\n","Apropiacion","Estudios a Distancia ","Posgrado","Doc. Ocasional","Asistente Investigación","Económico","Competencias personales y desarrollo",31,null,null,null,null,null,null,null,null,null,null,null,null,1,{"$f":"COUNTIF($AN$4:$AN$73,AL4)","v":1},1,"CIAS","Fitoplasmas y Virus","COL0028687","C","http://scienti.colciencias.gov.co:8085/gruplac/jsp/visualiza/visualizagr.jsp?nro=00000000008436",{"$f":"$AT$2&AV4&\":\"&$AT$2&AW4","v":"BB10:BB11"},{"$f":"ROW()","v":4},{"$f":"MINA(IF(AQ4=$BA$4:$BA$403,$BD$4:$BD$403))","v":10},{"$f":"MAXA(IF(AQ4=$BA$4:$BA$403,$BD$4:$BD$403))","v":11},{"$f":"AO4","v":"CIAS"},null,null,"COL0049659","Medios de comunicación, educación y salud",{"$f":"COUNTIF(BA$4:BA4,BA4)","v":1},{"$f":"ROW()","v":4},{"$f":"COUNTIF($AQ$3:$AQ$83,BA4)","v":1},null,"COL0015722",{"$f":"COUNTIF($AQ$4:$AQ$73,BG4)","v":1}]
[null,4,80,199.9,100,"Articulo A2","D",null,null,null,null,null,null,null,"Económico ",null,"No Aplica",null,"Ciencias Económicas ","Tecnólogia","Estudiante","Joven Investigador","Productividad","Ciencias de la educación",111,null,null,null,null,null,null,null,null,null,null,null,null,2,1,2,"CIAS","Grupo de investigación en Biodiversidad y ecología de abejas silvestres","COL0031959","B","http://scienti.colciencias.gov.co:8085/gruplac/jsp/visualiza/visualizagr.jsp?nro=00000000001366",{"$f":"$AT$2&AV5&\":\"&$AT$2&AW5","v":"BB12:BB16"},{"$f":"ROW()","v":5},{"$f":"MINA(IF(AQ5=$BA$4:$BA$403,$BD$4:$BD$403))","v":12},{"$f":"MAXA(IF(AQ5=$BA$4:$BA$403,$BD$4:$BD$403))","v":16},{"$f":"AO5","v":"CIAS"},null,null,"COL0049659","Salud Pública y Nutrición, Prevención de la Enfermedad y Promoción de la Salud",{"$f":"COUNTIF(BA$4:BA5,BA5)","v":2},{"$f":"ROW()","v":5},1,null,"COL0026486",1]
[null,5,200,1000,{"$f":"125*2","v":250},"Articulo B","Reconocido",null,null,null,null,null,null,null,"Social",null,null,null,"Educación y Humanidades","Especialización","OPS - Prestación Servicios","Estudiante","Social","Formación para docentes de educación pre-primaría",112,null,null,null,null,null,null,null,null,null,null,null,null,3,1,3,"CIAS","MATRIX","COL0039321","C","http://scienti.colciencias.gov.co:8085/gruplac/jsp/visualiza/visualizagr.jsp?nro=00000000002208","BB38:BB42",{"$f":"ROW()","v":6},{"$f":"MINA(IF(AQ6=$BA$4:$BA$403,$BD$4:$BD$403))","v":38},{"$f":"MAXA(IF(AQ6=$BA$4:$BA$403,$BD$4:$BD$403))","v":42},"CIAS",null,null,"COL0062704","Procesos Organizacionales (Prospectiva de las Organizaciones), Programáticos y Políticos para la Promoción del Desarrollo.",{"$f":"COUNTIF(BA$4:BA6,BA6)","v":1},{"$f":"ROW()","v":6},1,null,"COL0027367",1]
[null,6,null,null,null,"Articulo C",null,null,null,null,null,null,null,null,"Otros",null,null,null,"Ingeniería ","Maestria","Externo a la UMNG","Técnico","Institucional","Formación para docentes sin asignatura de especialización",113,null,null,null,null,null,null,null,null,null,null,null,null,4,1,4,"CIAS","Desarrollo e integración de estrategias alternativas para la protección de cultivos de importancia económica, con énfasis en control biológico.","COL0032278","A","http://scienti.colciencias.gov.co:8085/gruplac/jsp/visualiza/visualizagr.jsp?nro=00000000001399","BB64:BB65",{"$f":"ROW()","v":7},{"$f":"MINA(IF(AQ7=$BA$4:$BA$403,$BD$4:$BD$403))","v":64},{"$f":"MAXA(IF(AQ7=$BA$4:$BA$403,$BD$4:$BD$403))","v":65},"CIAS",null,null,"COL0062704","Prospectiva de las Organizaciones",{"$f":"COUNTIF(BA$4:BA7,BA7)","v":2},{"$f":"ROW()","v":7},1,null,"COL0018448",1]
[null,7,null,null,null,"Libro Completo",null,null,null,null,null,null,null,null,null,null,null,null,"Medicina y Ciencias de la Salud","Doctorado",null,"Investigador Principal","Areas de Salud","Formación para docentes con asignatura de especialización",114,null,null,null,null,null,null,null,null,null,null,null,null,5,1,5,"CIAS","Grupo de Micología y Fitopatologia ","COL0013719","A1","http://scienti.colciencias.gov.co:8085/gruplac/jsp/visualiza/visualizagr.jsp?nro=00000000001127","BB107:BB111",{"$f":"ROW()","v":8},{"$f":"MINA(IF(AQ8=$BA$4:$BA$403,$BD$4:$BD$403))","v":107},{"$f":"MAXA(IF(AQ8=$BA$4:$BA$403,$BD$4:$BD$403))","v":111},"CIAS",null,null,"COL0062704","Responsabilidad Ambiental",{"$f":"COUNTIF(BA$4:BA8,BA8)","v":3},{"$f":"ROW()","v":8},1,null,"COL0028767",1]
[null,8,null,null,null,"Cap. de Libro",null,null,null,null,null,null,null,null,null,null,null,null,"Relaciones Intenacionales, Estrategia y Seguridad","Pos doctorado",null,"Coinvestigador ","Innovacion ","Técnicas audiovisuales y producción para medios de comunicación",211,null,null,null,null,null,null,null,null,null,null,null,null,6,1,6,"CIAS","Fitopatologia molecular","COL0086179","C","http://scienti.colciencias.gov.co:8085/gruplac/jsp/visualiza/visualizagr.jsp?nro=00000000007907","BB118:BB120",{"$f":"ROW()","v":9},{"$f":"MINA(IF(AQ9=$BA$4:$BA$403,$BD$4:$BD$403))","v":118},{"$f":"MAXA(IF(AQ9=$BA$4:$BA$403,$BD$4:$BD$403))","v":120},"CIAS",null,null,"COL0062704","Responsabilidad Social Empresarial",{"$f":"COUNTIF(BA$4:BA9,BA9)","v":4},{"$f":"ROW()","v":9},1,null,"COL0028918",1]
[null,9,null,null,null,"Patentes",null,null,null,null,null,null,null,null,null,null,null,null,null,null,null,"Asistente Investigación","Científico ","Diseño industrial, de modas e interiores",212,null,null,null,null,null,null,null,null,null,null,null,null,7,1,7,"CIAS","Estadística, Control y Optimización","COL0136423","B","http://scienti.colciencias.gov.co:8085/gruplac/jsp/visualiza/visualizagr.jsp?nro=00000000013845","BB125:BB129",{"$f":"ROW()","v":10},{"$f":"MINA(IF(AQ10=$BA$4:$BA$403,$BD$4:$BD$403))","v":125},{"$f":"MAXA(IF(AQ10=$BA$4:$BA$403,$BD$4:$BD$403))","v":129},"CIAS",null,null,"COL0028687","Fitoplasmas",{"$f":"COUNTIF(BA$4:BA10,BA10)","v":1},{"$f":"ROW()","v":10},1,null,"COL0031824",1]
{"$rows_left_out":301}
{"sheet":"Datos_Generales","index":1,"n_rows":68,"n_cols":14,"rows_kept":68,"cut":false,"hidden":false,"merged":[[2,1,3,7],[45,2,45,3],[21,3,21,7],[9,3,9,7],[10,4,10,7],[35,4,35,6],[15,6,15,7],[13,3,13,4],[13,6,13,7],[14,3,14,4],[15,3,15,4],[11,3,11,7],[23,6,23,7],[44,2,44,3],[44,4,44,7]]}
[10,11,"2016-07-07"]
[]
[null,"PRESENTACIÓN DE PROYECTOS \nDE INICIACIÓN CIENTIFÍCA 2020 - 1"]
[]
[null,null,null,null,null,null,null,null,null,null,"No","Hoja ","Validacion","Pendientes"]
[null,null,"Datos digilenciados VICIEIN.",null,"Código :",null,"Radicado :",null,null,null,1,"Datos Generales","Datos Generales sin llenar. = > >",{"$f":"SUM(I8:I45)","v":6}]
[]
[null,"1.","INFORMACION GENERAL DEL PROYECTO:",null,null,"Vrs.05.21","Facultad  :",null,{"$f":"IF(H8=0,1,\"\")","v":1},null,2,"Resumen","Hay textos en resumen",{"$f":"IF(Resumen!K4>0,\"OK :\"&Resumen!K4&\" Lt:\"&Resumen!K5,\"Falta\")","v":"Falta"}]
[]
[null,null,"Título",null,null,null,null,null,{"$f":"IF(D10=0,1,\"\")","v":1}]
{"$rows_left_out":59}
{"sheet":"Resumen","index":2,"n_rows":18,"n_cols":12,"rows_kept":18,"cut":false,"hidden":false,"merged":[[3,1,4,7],[17,2,17,7],[16,2,16,7],[8,2,8,7],[9,2,9,7],[11,2,11,7],[10,2,10,7],[12,2,12,7],[13,2,13,7],[14,2,14,7],[15,2,15,7]]}
[]
[]
[]
[null,{"$f":"Datos_Generales!B3","v":"PRESENTACIÓN DE PROYECTOS \nDE INICIACIÓN CIENTIFÍCA 2020 - 1"},null,null,null,null,null,null,null,null,{"$f":"COUNTIF(C9:H80,\"<>\"&\"\")","v":0},"=> Numero de resgistros de resumenes diligenciados."]
[null,null,null,null,null,null,null,null,null,null,{"$f":"SUM(K9:K80)","v":0},"=> Numero de caracteres diligenciados"]
[null,null,null,null,null,null,null,null,null,null,"Tener en cuenta "]
[null,"6.","Resumen de Proyecto - Maximo 500 Caracteres.",null,null,null,null,null,null,null,"No debe tener mas de 999 caracteres por celda o de largo"]
[null,null,null,null,null,null,null,null,null,null,"Validación en número de caracteres"]
[null,1,null,null,null,null,null,null,null,null,{"$f":"LEN(C9)","v":0}]
[null,2,null,null,null,null,null,null,null,null,{"$f":"LEN(C10)","v":0}]
{"$rows_left_out":9}
{"sheet":"Descripción","index":3,"n_rows":25,"n_cols":12,"rows_kept":25,"cut":false,"hidden":false,"merged":[[24,2,24,7],[9,2,9,7],[10,2,10,7],[11,2,11,7],[12,2,12,7],[17,2,17,7],[18,2,18,7],[19,2,19,7],[20,2,20,7],[21,2,21,7],[22,2,22,7],[23,2,23,7],[13,2,13,7],[14,2,14,7],[15,2,15,7],[16,2,16,7],[3,1,4,7]]}
[]
[]
[]
[null,{"$f":"Resumen!B4","v":"PRESENTACIÓN DE PROYECTOS \nDE INICIACIÓN CIENTIFÍCA 2020 - 1"}]
[null,null,null,null,null,null,null,null,null,null,{"$f":"COUNTIF(C10:H81,\"<>\"&\"\")","v":0},"=> Numero de resgistros de descripción diligenciados."]
[null,null,null,null,null,null,null,null,null,null,{"$f":"SUM(K10:K81)","v":0},"=> Numero de caracteres diligenciados"]
[null,"7.","ESTRUCTURA DEL PROYECTO",null,null,null,null,null,null,null,"Tener en cuenta "]
[null,"a.","Descripción y Justificación del Proyecto ",null,null,null,null,null,null,null,"Tener en cuenta "]
[null,null,null,null,null,null,null,null,null,null,"No debe tener mas de 999 caracteres o de largo"]
[null,null,null,null,null,null,null,null,null,null,{"$f":"LEN(C10)","v":0}]
{"$rows_left_out":16}
{"sheet":"Objetivos","index":4,"n_rows":28,"n_cols":11,"rows_kept":28,"cut":false,"hidden":false,"merged":[[8,2,8,7],[12,2,12,7],[13,2,13,7],[14,2,14,7],[2,1,4,7],[15,2,15,7],[27,2,27,7],[16,2,16,7],[17,2,17,7],[18,2,18,7],[19,2,19,7],[20,2,20,7],[21,2,21,7],[22,2,22,7],[23,2,23,7],[24,2,24,7],[25,2,25,7],[26,2,26,7]]}
[]
[]
[null,{"$f":"Resumen!B4","v":"PRESENTACIÓN DE PROYECTOS \nDE INICIACIÓN CIENTIFÍCA 2020 - 1"}]
[]
[]
[null,null,null,null,null,null,null,null,null,null,"Tener en cuenta "]
[null,"8.a","Información Objetivo -  General ",null,null,null,null,{"$f":"PD!J7","v":"PIC"},null,null,"Tener en cuenta "]
[null,null,null,null,null,null,null,null,null,null,"No debe tener mas de 999 caracteres o de largo"]
[null,">>",null,null,null,null,null,null,null,null,{"$f":"LEN(C9)","v":0}]
[]
{"$rows_left_out":19}
{"sheet":"Metodología","index":5,"n_rows":22,"n_cols":11,"rows_kept":22,"cut":false,"hidden":false,"merged":[[21,2,21,7],[3,1,4,7],[17,2,17,7],[18,2,18,7],[19,2,19,7],[20,2,20,7],[14,2,14,7],[15,2,15,7],[16,2,16,7],[13,2,13,7],[9,2,9,7],[10,2,10,7],[11,2,11,7],[12,2,12,7]]}
[]
[]
[]
[null,{"$f":"Datos_Generales!B3","v":"PRESENTACIÓN DE PROYECTOS \nDE INICIACIÓN CIENTIFÍCA 2020 - 1"}]
[null,null,null,null,null,null,null,null,null,null,{"$f":"SUM(K10:K133)","v":0}]
[]
[null,"9.","ESTRUCTURA DEL PROYECTO",null,null,null,null,null,null,null,"Tener en cuenta "]
[null,"a.","Metodología propuesta para alcanzar cada uno de los objetivos específicos propuestos",null,null,null,null,null,null,null,"No debe tener mas de 999 caracteres por celda o de largo"]
[null,null,null,null,null,null,null,null,null,null,"Validación en número de caracteres"]
[null,1,null,null,null,null,null,null,null,null,{"$f":"LEN(C10)","v":0}]
{"$rows_left_out":13}
{"sheet":"Estado_del_Arte","index":6,"n_rows":25,"n_cols":11,"rows_kept":25,"cut":false,"hidden":false,"merged":[[15,1,15,7],[16,1,16,7],[17,1,17,7],[18,1,18,7],[24,1,24,7],[19,1,19,7],[20,1,20,7],[21,1,21,7],[22,1,22,7],[23,1,23,7],[3,1,4,7],[14,1,14,7],[13,1,13,7],[9,1,9,7],[10,1,10,7],[11,1,11,7],[12,1,12,7]]}
[]
[]
[]
[null,{"$f":"Datos_Generales!B3","v":"PRESENTACIÓN DE PROYECTOS \nDE INICIACIÓN CIENTIFÍCA 2020 - 1"}]
[null,null,null,null,null,null,null,null,null,null,{"$f":"SUM(K10:K313)","v":0}]
[]
[null,"10.","ESTRUCTURA DEL PROYECTO",null,null,null,null,null,null,null,"Tener en cuenta "]
[null,"b.","Estado del arte de la investigación, innovacion o emprendimiento",null,null,null,null,null,null,null,"No debe tener mas de 999 caracteres por celda o de largo"]
[null,null,null,null,null,null,null,null,null,null,"Validación en número de caracteres"]
[null,null,null,null,null,null,null,null,null,null,{"$f":"LEN(B10)","v":0}]
{"$rows_left_out":16}
{"sheet":"Marco_Teorico","index":7,"n_rows":25,"n_cols":11,"rows_kept":25,"cut":false,"hidden":false,"merged":[[19,1,19,7],[3,1,4,5],[9,1,9,7],[10,1,10,7],[11,1,11,7],[12,1,12,7],[13,1,13,7],[14,1,14,7],[15,1,15,7],[16,1,16,7],[17,1,17,7],[18,1,18,7],[20,1,20,7],[21,1,21,7],[22,1,22,7],[23,1,23,7],[24,1,24,7]]}
[]
[]
[]
[null,{"$f":"Datos_Generales!B3","v":"PRESENTACIÓN DE PROYECTOS \nDE INICIACIÓN CIENTIFÍCA 2020 - 1"},null,null,null,null,"Fecha de Emisión: 2014/07/31","IN-IV-F-14"]
[null,null,null,null,null,null,"Revision N°:\n1","Marco Teorico",null,null,{"$f":"SUM(K10:K313)","v":0}]
[]
[null,"9.","ESTRUCTURA DEL PROYECTO",null,null,null,null,null,null,null,"Tener en cuenta "]
[null,"c.","Marco Teorico",null,null,null,null,null,null,null,"No debe tener mas de 999 caracteres por celda o de largo"]
[null,null,null,null,null,null,null,null,null,null,"Validación en número de caracteres"]
[null,null,null,null,null,null,null,null,null,null,{"$f":"LEN(B10)","v":0}]
{"$rows_left_out":16}
{"sheet":"Cronograma","index":8,"n_rows":24,"n_cols":12,"rows_kept":24,"cut":false,"hidden":false,"merged":[[3,1,4,7],[24,2,24,7],[10,2,10,5],[11,2,11,5],[12,2,12,5],[13,2,13,5],[14,2,14,5],[15,2,15,5],[16,2,16,5],[17,2,17,5],[18,2,18,5],[19,2,19,5],[20,2,20,5],[21,2,21,5],[22,2,22,5],[23,2,23,5]]}
[]
[]
[]
[null,{"$f":"Datos_Generales!B3","v":"PRESENTACIÓN DE PROYECTOS \nDE INICIACIÓN CIENTIFÍCA 2020 - 1"},null,null,null,null,null,null,null,null,"Se pasan de Vigencia :",{"$f":"COUNTIF(L12:L24,\">\"&meses)","v":0}]
[]
[]
[null,"T","Tiempo total maximo de ejecucion por convocatoria (Meses): ",null,null,null,{"$f":"IFERROR(VLOOKUP(Elec_Conv,Conv_Opc,3,0),\"\")","v":5},null,null,null,"Tener en cuenta "]
[null,null,null,null,null,null,null,null,null,null,"No debe tener mas de 999 caracteres por celda o de largo"]
[null,"11.","Cronograma de Actividades ",null,null,null,null,null,null,null,"Validación en número de caracteres"]
[null,null,null,null,null,null,null,null,null,null,{"$f":"COUNTIF(K12:K26,\">\"&0)","v":0},{"$f":"COUNTIF(L12:L24,\">\"&meses)","v":0}]
{"$rows_left_out":15}
{"sheet":"PD","index":9,"n_rows":49,"n_cols":26,"rows_kept":49,"cut":false,"hidden":false,"merged":[[24,2,24,3],[24,8,24,9],[28,2,28,3],[28,8,28,9],[29,2,29,3],[29,8,29,9],[25,2,25,3],[25,8,25,9],[26,2,26,3],[26,8,26,9],[27,2,27,3],[27,8,27,9],[21,2,21,3],[21,8,21,9],[22,2,22,3],[22,8,22,9],[23,2,23,3],[23,8,23,9],[18,2,18,3],[18,8,18,9],[19,2,19,3],[19,8,19,9],[20,2,20,3],[20,8,20,9],[15,2,15,3],[15,8,15,9],[16,2,16,3],[16,8,16,9],[17,2,17,3],[17,8,17,9],[12,8,12,9],[13,2,13,3],[13,8,13,9],[14,2,14,3],[14,8,14,9],[3,6,3,7],[4,6,4,7],[3,1,4,5],[30,8,30,9],[7,15,7,20],[3,8,3,9],[4,8,4,9],[8,2,8,3],[8,8,8,9],[9,2,9,3],[9,8,9,9],[10,2,10,3],[10,8,10,9],[11,2,11,3],[11,8,11,9],[12,2,12,3]]}
[]
[]
[]
[null,{"$f":"Datos_Generales!B3","v":"PRESENTACIÓN DE PROYECTOS \nDE INICIACIÓN CIENTIFÍCA 2020 - 1"},null,null,null,null,"Fecha de Emisión: 2014/07/31",null,"IN-IV-F-14"]
[null,null,null,null,null,null,"Revision N°:\n1",null,"Productividad",null,null,null,null,null,null,"INV","IMP","PIC","INO","PRO","EMP"]
[null,null,null,null,null,null,null,null,null,null,null,null,null,null,null,3,{"$f":"P6+1","v":4},{"$f":"Q6+1","v":5},{"$f":"R6+1","v":6},{"$f":"S6+1","v":7},{"$f":"T6+1","v":8}]
[null,"11.","Información de productividad comprometida del proyecto.",null,null,null,null,{"$f":"HLOOKUP(J7,P5:U7,2,0)","v":5},{"$f":"H31","v":0},{"$f":"IFERROR(Integrantes!I7,\"NA\")","v":"PIC"},null,{"$f":"SUM(K10:K30)","v":0}]
[null,null,null,null,null,null,null,{"$f":"Integrantes!S10","v":0},null,null,null,null,null,null,null,"Puntajes Asociados "]
[null,"No","Resultado/Producto esperado",null,"Descripción o detalles del producto esperado","Indicador","Cantidad","Total Puntos","Beneficiario de la optención del Prod.",null,null,null,null,"Abreviatura","IdClase","INV","IMP","PIC","INO","PRO","EMP","Clase ","Tipo de Productos","Indicadores","o"]
[null,1,null,null,null,{"$f":"IFERROR(VLOOKUP($C10,Tabla_prod,11,0),\" \")","v":" "},1,{"$f":"IFERROR(VLOOKUP($C10,Tabla_prod,$H$7,0)*G10,0)","v":0},null,null,{"$f":"IF(C10<>0,IF(AND(E10<>0,I10<>0),0,1),0)","v":0},{"$f":"IFERROR(VLOOKUP($C10,$N$9:$O$201,2,0),0)","v":0},null,"Articulo Q1","GNC",60,60,0,0,0,0,"Productos de Generación de Nuevo Conocimiento (GNC) ","En Cuartil 1 (Q1) de Scimago ","Sometido","o"]
{"$rows_left_out":40}
{"sheet":"Integrantes","index":10,"n_rows":32,"n_cols":15,"rows_kept":32,"cut":false,"hidden":false,"merged":[[9,1,11,1],[14,4,14,8],[12,1,14,1],[15,1,17,1],[17,4,17,8],[10,7,10,8],[9,3,9,4],[9,5,9,6],[10,3,10,4],[12,3,12,4],[12,5,12,6],[11,4,11,8],[8,3,8,4],[8,5,8,6],[3,1,4,8],[31,1,31,8],[13,7,13,8],[16,7,16,8],[15,3,15,4],[15,5,15,6],[16,3,16,4],[13,3,13,4],[18,3,18,4],[19,3,19,4],[18,1,20,1],[18,5,18,6],[19,7,19,8],[20,4,20,8]]}
[]
[]
[]
[null,{"$f":"Datos_Generales!B3","v":"PRESENTACIÓN DE PROYECTOS \nDE INICIACIÓN CIENTIFÍCA 2020 - 1"}]
[]
[]
[null,"15.","Imformacion de Integrantes del Proyecto",null,null,null,{"$f":"\"FunProy_\"&I7","v":"FunProy_PIC"},{"$f":"\"FunProy_\"&J7","v":"FunProy_"},{"$f":"IFERROR(VLOOKUP(Elec_Conv,Opciones!$K$1:$L$7,2,0),\"NA\")","v":"PIC"}]
[null,null,null,null,null,null,null,5]
[null,"No","Identificacion","Nombres",null,"Apellidos",null,"Mes","Horas",null,null,null,"N","Funcion"]
[{"$f":"B9","v":"No"},1,null,null,null,null,null,5,null,null,null,null,1,"Tutor ",{"$f":"COUNTIF($G$11:$G$31,N10)","v":1}]
{"$rows_left_out":23}
{"sheet":"Presupuesto","index":11,"n_rows":85,"n_cols":15,"rows_kept":85,"cut":false,"hidden":false,"merged":[[37,4,37,5],[38,4,38,5],[44,4,44,5],[45,4,45,5],[46,4,46,5],[39,4,39,5],[40,4,40,5],[41,4,41,5],[42,4,42,5],[43,4,43,5],[32,4,32,5],[33,4,33,5],[34,4,34,5],[35,4,35,5],[36,4,36,5],[27,2,27,8],[28,3,28,8],[30,4,30,5],[31,4,31,5],[3,1,4,8],[57,2,57,8],[58,3,58,8],[63,2,63,4],[74,4,78,5],[81,4,81,8],[81,1,81,3]]}
[]
[]
[]
[null,{"$f":"Datos_Generales!B3","v":"PRESENTACIÓN DE PROYECTOS \nDE INICIACIÓN CIENTIFÍCA 2020 - 1"}]
[]
[]
[null,"12.","Anexo Para el calculo de presupuesto contrapartida por parte de personal investigativo.",null,null,null,null,{"$f":"Integrantes!I7","v":"PIC"},{"$f":"INT(PD!H31)","v":0}]
[]
[null,"A.","Personal de Planta integrado al proyecto.",null,null,1.61]
[]
{"$rows_left_out":76}
{"sheet":"Impactos","index":12,"n_rows":21,"n_cols":12,"rows_kept":21,"cut":false,"hidden":false,"merged":[[3,2,4,6],[14,4,14,8],[19,4,19,8],[9,4,9,8],[10,4,10,8],[11,4,11,8],[12,4,12,8],[13,4,13,8],[15,4,15,8],[16,4,16,8],[17,4,17,8],[18,4,18,8]]}
[]
[]
[]
[null,null,{"$f":"Datos_Generales!B3","v":"PRESENTACIÓN DE PROYECTOS \nDE INICIACIÓN CIENTIFÍCA 2020 - 1"},null,null,null,null,"Fecha de Emisión: 2014/07/31","IN-IV-F-14"]
[null,null,null,null,null,null,null,"Revision N°:\n1","Impactos Esperados",null,null,{"$f":"SUM(L10:L133)","v":0}]
[null,null,null,null,null,null,null,null,null,null,null,{"$f":"COUNTIF(L11:L21,\"<>\"&0)","v":0}]
[null,null,"17.","ESTRUCTURA DEL PROYECTO",null,null,null,null,null,null,null,"Tener en cuenta "]
[null,null,"c.","Pertinencia e impacto de la propuesta en el contexto social y académico.",null,null,null,null,null,null,null,"No debe tener mas de 999 caracteres por celda o de largo"]
[null,null,null,null,null,null,null,null,null,null,null,"Validación en número de caracteres"]
[null,null,"No. ","Tipo ","Descripción"]
{"$rows_left_out":12}
{"sheet":"Grupo","index":13,"n_rows":33,"n_cols":12,"rows_kept":33,"cut":false,"hidden":false,"merged":[[3,2,4,6],[17,3,17,8],[20,3,20,8],[29,3,29,8],[32,3,32,8],[10,3,10,8],[14,3,14,8],[11,4,11,8],[23,3,23,8],[26,3,26,8]]}
[]
[]
[]
[null,null,{"$f":"Datos_Generales!B3","v":"PRESENTACIÓN DE PROYECTOS \nDE INICIACIÓN CIENTIFÍCA 2020 - 1"},null,null,null,null,"Fecha de Emisión: 2014/07/31","IN-IV-F-14"]
[null,null,null,null,null,null,null,"Revision N°:\n1","Grupo de Investigación ",null,null,{"$f":"COUNTIF(L11:L35,0)","v":9}]
[null,null,null,null,null,null,null,null,null,null,null,"Tener en cuenta "]
[null,null,"18.","CONFORMACIÓN Y TRAYECTORIA DEL GRUPO DE INVESTIGACIÓN-",null,null,null,null,null,null,null,"No debe tener mas de 999 caracteres por celda o de largo"]
[null,null,null,"Se puede utilizar la convinación de teclas (Atl + Enter) para adicionar una nueva linea en las celdas o adicionar Filas "]
[]
[null,null,"a.","Nombre del grupo de Investigación:",null,null,null,null,null,null,null,{"$f":"SUM(L11:L35)","v":0}]
{"$rows_left_out":24}
{"sheet":"Biblografia","index":14,"n_rows":19,"n_cols":12,"rows_kept":19,"cut":false,"hidden":false,"merged":[[9,3,9,8],[10,3,10,8],[11,3,11,8],[12,3,12,8],[3,2,4,8],[18,3,18,8],[13,3,13,8],[14,3,14,8],[15,3,15,8],[16,3,16,8],[17,3,17,8]]}
[]
[]
[]
[null,null,{"$f":"Datos_Generales!B3","v":"PRESENTACIÓN DE PROYECTOS \nDE INICIACIÓN CIENTIFÍCA 2020 - 1"},null,null,null,null,null,null,null,null,{"$f":"COUNTIF(L10:L70,\">\"&0)","v":0}]
[null,null,null,null,null,null,null,null,null,null,null,{"$f":"SUM(L10:L83)","v":0}]
[null,null,null,null,null,null,null,null,null,null,null,"Tener en cuenta "]
[null,null,"16.","ESTRUCTURA DEL PROYECTO",null,null,null,null,null,null,null,"No debe tener mas de 999 caracteres por celda o de largo"]
[null,null,"c.","Bibliografia citada en la  estructura del proyecto",null,null,null,null,null,null,null,"Validación en número de caracteres"]
[]
[null,null,1,null,null,null,null,null,null,null,null,{"$f":"LEN(D10)","v":0}]
{"$rows_left_out":10}
{"sheet":"Imagenes","index":15,"n_rows":18,"n_cols":13,"rows_kept":18,"cut":false,"hidden":false,"merged":[[3,1,4,7],[13,2,13,9],[9,2,9,9],[10,2,10,9],[11,2,11,9],[12,2,12,9],[14,2,14,9],[15,2,15,9],[16,2,16,9],[17,2,17,9],[18,2,18,9]]}
[]
[]
[]
[null,{"$f":"Datos_Generales!B3","v":"PRESENTACIÓN DE PROYECTOS \nDE INICIACIÓN CIENTIFÍCA 2020 - 1"},null,null,null,null,null,null,"Fecha de Emisión: 2014/07/31","IN-IV-F-14"]
[null,null,null,null,null,null,null,null,"Revision N°:\n1","Apartes"]
[]
[null,"20.","Imágenes que contiene el proyecto"]
[null,"1.","Hoja destinada para elementos que estructuralmente se ingresan en los apartes de la propuesta de investigación."]
[null,null,null,null,null,null,null,null,null,null,null,null,"No debe tener mas de 1024 caracteres o de largo"]
[null,1,null,null,null,null,null,null,null,null,null,null,{"$f":"LEN(C10)","v":0}]
{"$rows_left_out":9}
{"sheet":"Normas","index":16,"n_rows":27,"n_cols":12,"rows_kept":27,"cut":false,"hidden":false,"merged":[[19,4,19,8],[21,4,21,8],[15,4,15,8],[7,4,7,8],[2,2,3,6],[24,3,24,8],[8,4,8,8],[9,4,9,8],[10,4,10,8],[16,4,16,8],[18,4,18,8],[11,4,11,8],[12,4,12,8],[13,4,13,8],[14,4,14,8],[20,4,20,8],[22,4,22,8],[17,4,17,8],[23,4,23,8]]}
[]
[]
[null,null,{"$f":"Datos_Generales!B3","v":"PRESENTACIÓN DE PROYECTOS \nDE INICIACIÓN CIENTIFÍCA 2020 - 1"},null,null,null,null,"Fecha de Emisión: 2014/07/31","IN-IV-F-14"]
[null,null,null,null,null,null,null,"Revision N°:\n1","Normas"]
[]
[null,null,"1.","Normas para el diligenciamiento de formulación de proyecto",null,null,null,null,"(No Imprimir esta hoja) ",null,null,"Tener en cuenta "]
[null,null,null,null,null,null,null,null,null,null,null,"No debe tener mas de 1024 caracteres o de largo"]
[null,null,"No","Tema","Descripción"]
[null,null,1,"Fuentes de Finaciacion","Se entiende como Contrapartida todos los aportes que dedica la Unidad Académica (Facultades a través de los Centros de Investigaciones, Departamentos, Institutos) u otras entidades para apoyar el desarrollo del  proyecto. El objetivo de esta exigencia de contrapartida es comprometer a la Unidad Académica con el buen desarrollo de la investigación,  asegurando la continuidad y estabilidad del grupo investigador.",null,null,null,null,null,null,{"$f":"LEN(E9)","v":414}]
[null,null,2,"Rubros financiables con recursos  VICEIN UMNG","Con cargo a recursos de VICEIN UMNG (en modalidad de recuperación contingente) se podrán financiar solamente los siguientes rubros: Personal, Equipos, Software, Materiales, Salidas de Campo, Servicios Técnicos, Movilidades, Material Biblografico y Papeleria",null,null,null,null,null,null,{"$f":"LEN(E10)","v":257}]
{"$rows_left_out":17}