{"text_format":"1","workbook":"xlsx","n_sheets":14,"sheets":["Dt","General","Resumen","Estado_del_arte","Objetivos","Metodología","Etica","Cronograma","Crono","Integrantes","Productos","Presupuesto","Impactos","Bibliografía"],"not_rendered":{"charts":0,"images":1,"macros":1,"external_links":0,"defined_names":65,"comments":7,"pivot_tables":0},"unopened":[],"bounds":{"document_bytes":16777216,"sheet_cells":100000,"rows_first":2000,"rows_last":500,"rows_between":2000,"halvings":0,"cell_chars":16384,"cell_head_chars":4096},"cells_cut":0,"cells_raw":0,"read":"whole","date_system":"1900"}

{"sheet":"Dt","index":0,"n_rows":2006,"n_cols":644,"rows_kept":2006,"cut":false,"hidden":true,"merged":[]}
[null,"No eliminar Hoja … :)))",null,null,null,null,null,"Cronograma",null,null,"Integrante",null,null,null,null,null,null,null,null,null,null,null,null,null,null,null,"No","Campo ","1_Opcion","2_Opcion",null,"Avaya1719",null,null,null,null,null,null,null,null,null,"2018-03-16","http://scienti.colciencias.gov.co:8080/gruplac/jsp/visualiza/visualizagr.jsp?nro=",null,null,null,null,null,null,null,null,null,null,null,null,null,null,null,null,null,null,null,null,null,null,null,null,null,null,null,null,null,null,null,null,null,null,null,null,null,null,null,null,null,null,null,null,null,null,null,null,null,null,null,null,null,null,null,null,null,{"$f":"Productos!H5","v":"PAZ"}]
[null,null,null,null,null,"Tipo","Objetivo","Actividad","Mes Inicio","Duracion","CC","Nombre","Apellidos","Nivel","Mes","Horas","Rol","Vin","NBC","Cvlac","Nombre Completo",null,null,null,null,null,1,"Sedes","Bogotá",null,null,null,null,null,null,null,null,null,null,null,null,null,null,null,null,"BB",null,{"$f":"MIN(BD3:BD293)","v":4},{"$f":"MAX(BD3:BD293)","v":293},null,null,null,null,null,null,null,null,null,null,null,null,null,null,null,null,null,null,null,null,null,null,null,null,null,null,null,null,null,null,"Variables aplicadas a la Hoja de impactos",null,null,null,null,null,null,null,null,null,null,"Id","IDFinal","Clase","Subclase","Producto","Indicador","INV","IMP"]
[null,null,"Dato",null," ",{"$f":"ROW()-3","v":0},{"$f":"CLEAN(TRIM(Objetivos!C8))","v":""},"NA","NA","NA","NA","NA","NA","NA","NA","NA","NA","NA","NA","NA","NA",null,null,null,null,null,2,"Sedes","Campus Nueva Granada",null,null,null,null,null,null,null,"Hoja",null,null,"Hoja","FAC","Grupo","COD","Clas","Link","Lineas","Fila Grupo","Min","Max","FAC",null,null,"COD","Linea","Cel","Fila","E:Gp",null,null,"Hora","Agente","Agente",null,null,null,"Areas Grupos UMN",null,null,null,null,null,"No","Areas","Area1","Area2",null,null,null,null,"No","Tipo","Duración","Tipo","Alcance","Linea","SRL",null,null,null,null,{"$f":"ROW()-2","v":1},{"$f":"100+COUNTA(CO$3:CO3)","v":101},"Productos de Generación de Nuevo Conocimiento (GNC)","Artículos en Revistas Científicas no incluidas en las listas de revistas depredadoras (ejemplo Beall-list)","Artículo en Cuartil 1 (Q1) del SJR (Scopus) o del JCR (Web of Science)","Copia del sometimiento y copia del artículo enviado a la revista",60,60]
[null,null,"Titulo",{"$f":"TRIM(CLEAN(General!B9))","v":"Formato: actualizado a 06 Sep 2019"},null,{"$f":"ROW()-3","v":1},{"$f":"CLEAN(TRIM(Objetivos!C9))","v":""},{"$f":"CLEAN(TRIM(Cronograma!C8))","v":""},{"$f":"Cronograma!D8","v":0},{"$f":"Cronograma!E8","v":12},{"$f":"INDEX(Dt_Integ,2+($F4-1)*3,(COLUMN()-9))","v":0},"Luis Alexander",0,0,12,25,{"$f":"INDEX(Dt_Integ,3+($F4-1)*3,(COLUMN()-14))","v":"Investigador Principal"},{"$f":"INDEX(Dt_Integ,3+($F4-1)*3,(COLUMN()-14))","v":0},{"$f":"INDEX(Dt_Integ,3+($F4-1)*3,(COLUMN()-14))","v":0},{"$f":"INDEX(Dt_Integ,4+($F4-1)*3,(COLUMN()-17))","v":0},{"$f":"(TRIM(L4&\" \"&M4))","v":"Luis Alexander 0"},null,null,null,null,null,3,"Sedes","Medicina","No habilitada 2018",null,null,null,null,null,null,3,1,{"$f":"COUNTIF($AN$4:$AN$806,AL4)","v":1},1,"CIAS","Fitoplasmas y Virus","COL0028687","C","https://scienti.colciencias.gov.co/gruplac/jsp/visualiza/visualizagr.jsp?nro=00000000008436",{"$f":"$AT$2&AV4&\":\"&$AT$2&AW4","v":"BB76:BB77"},{"$f":"ROW()","v":4},{"$f":"MINA(IF(AQ4=$BA$4:$BA$401,$BD$4:$BD$401))","v":76},{"$f":"MAXA(IF(AQ4=$BA$4:$BA$401,$BD$4:$BD$401))","v":77},{"$f":"AO4","v":"CIAS"},null,null,"COL0069296","Modelos de simulación",{"$f":"COUNTIF(BA$4:BA4,BA4)","v":1},{"$f":"ROW()","v":4},{"$f":"COUNTIF($AQ$3:$AQ$83,BA4)","v":1},null,null,"19:54:00","a","a",{"$f":"DMIN(BH3:BI12,\"hora\",BJ3:BJ4)","v":0.4548611111111111},"|",null,"Biotecnología",null,null,null,null,null,1,{"$f":"BV4&\"-\"&BW4","v":"Ciencias Naturales-Matemática"},"Ciencias Naturales","Matemática",{"$f":"BT4","v":1},null,null,null,1,"Fin de la pobreza","Corto (1 año)","Político","Regional","Transferencia e intercambio de conocimiento","SRL 0 – Identificación del problema.",null,null,null,null,{"$f":"ROW()-2","v":2},{"$f":"100+COUNTA(CO$3:CO4)","v":102},"Productos de Generación de Nuevo Conocimiento (GNC)","Artículos en Revistas Científicas no incluidas en las listas de revistas depredadoras (ejemplo Beall-list)","Artículo en Cuartil 2 (Q2) del SJR (Scopus) o del JCR (Web of Science) WoS ","Copia del sometimiento y copia del artículo enviado a la revista",50,50]
[null,null,"Lider",{"$f":"TRIM(CLEAN(General!C10))","v":"Luis Alexander Chirivi"},null,{"$f":"ROW()-3","v":2},{"$f":"CLEAN(TRIM(Objetivos!C10))","v":""},{"$f":"CLEAN(TRIM(Cronograma!C9))","v":""},{"$f":"Cronograma!D9","v":12},{"$f":"Cronograma!E9","v":0},"Contribuciones"," ",0,0,0,0,{"$f":"INDEX(Dt_Integ,3+($F5-1)*3,(COLUMN()-14))","v":0},0,null,"Coinvestigador",{"$f":"TRIM(L5&\" \"&M5)","v":"0"},null,null,null,null,null,4,"Sedes","Otros","No habilitada 2018",null,null,null,null,null,null,4,2,1,2,"CIAS","Grupo de investigación en Biodiversidad y ecología de abejas silvestres","COL0031959","B","https://scienti.colciencias.gov.co/gruplac/jsp/visualiza/visualizagr.jsp?nro=00000000001366",{"$f":"$AT$2&AV5&\":\"&$AT$2&AW5","v":"BB172:BB176"},{"$f":"ROW()","v":5},{"$f":"MINA(IF(AQ5=$BA$4:$BA$401,$BD$4:$BD$401))","v":172},{"$f":"MAXA(IF(AQ5=$BA$4:$BA$401,$BD$4:$BD$401))","v":176},{"$f":"AO5","v":"CIAS"},null,null,"COL0036749","Accesibilidad",{"$f":"COUNTIF(BA$4:BA5,BA5)","v":1},{"$f":"ROW()","v":5},1,null,null,"09:54:00","b","B",null,null,null,null,null,null,null,null,null,2,{"$f":"BV5&\"-\"&BW5","v":"Ciencias Naturales-Ciencias Físicas"},"Ciencias Naturales","Ciencias Físicas",{"$f":"BT5","v":2},null,null,null,{"$f":"CB4+1","v":2},"Hambre Cero ","Medio (2 años)","Salud","Nacional","Gestión del conocimiento para la apropiación","SRL 1 – Identificación del problema y el grado de madurez social.",null,null,null,null,3,{"$f":"100+COUNTA(CO$3:CO5)","v":103},"Productos de Generación de Nuevo Conocimiento (GNC)","Artículos en Revistas Científicas no incluidas en las listas de revistas depredadoras (ejemplo Beall-list)","Artículo en Cuartil 3 (Q3) del SJR (Scopus) o del JCR (Web of Science) y/o Homologada B Colciencias","Copia del sometimiento y copia del artículo enviado a la revista",40,40]
[null,null,"Sede",{"$f":"General!H12","v":0},null,3,{"$f":"CLEAN(TRIM(Objetivos!C11))","v":""},{"$f":"CLEAN(TRIM(Cronograma!C10))","v":""},{"$f":"Cronograma!D10","v":0},{"$f":"Cronograma!E10","v":0},"CvLac:",0,0,0,0,0,0,0,null,0,"0 0",null,null,null,null,null,1,"Facultad","Ciencias Básicas y Aplicadas","CIAS",null,null,null,null,null,null,12,3,1,3,"CIAS","MATRIX","COL0039321","C","https://scienti.colciencias.gov.co/gruplac/jsp/visualiza/visualizagr.jsp?nro=00000000002208","BB153:BB157",{"$f":"ROW()","v":6},{"$f":"MINA(IF(AQ6=$BA$4:$BA$401,$BD$4:$BD$401))","v":153},{"$f":"MAXA(IF(AQ6=$BA$4:$BA$401,$BD$4:$BD$401))","v":157},"CIAS",null,null,"COL0036749","Multimedia Analítica",{"$f":"COUNTIF(BA$4:BA6,BA6)","v":2},{"$f":"ROW()","v":6},1,null,null,"17:54:00","c","c",null,null,null,null,null,null,null,null,null,3,"Ciencias Naturales-Ciencias Biológicas","Ciencias Naturales","Ciencias Biológicas",3,null,null,null,3,"Salud y bienestar","Largo (3 años)","Tecnológico","Internacional","Participación ciudadana en CTeI","SRL 2 – Formulación del problema, soluciones propuestas e impacto potencial, grado de madurez social esperado; identificación de partes interesadas relevantes para el proyecto",null,null,null,null,4,{"$f":"100+COUNTA(CO$3:CO6)","v":104},"Productos de Generación de Nuevo Conocimiento (GNC)","Artículos en Revistas Científicas no incluidas en las listas de revistas depredadoras (ejemplo Beall-list)","Artículo en Cuartil 4 (Q4) del SJR (Scopus) o del JCR (Web of Science) y/o Homologada C Colciencias","Copia del sometimiento y copia del artículo enviado a la revista",30,30]
{"$rows_left_out":2001}
{"sheet":"General","index":1,"n_rows":96,"n_cols":28,"rows_kept":96,"cut":false,"hidden":false,"merged":[[40,7,40,8],[38,2,38,6],[39,2,39,6],[13,2,13,5],[13,7,13,8],[27,2,27,8],[33,2,33,6],[35,2,35,8],[37,2,37,8],[25,2,25,8],[19,2,19,8],[23,2,23,8],[68,1,68,8],[43,2,43,8],[47,2,47,8],[44,2,44,6],[45,2,45,6],[46,7,46,8],[49,2,49,8],[50,2,50,6],[51,2,51,6],[52,7,52,8],[53,2,53,8],[55,2,55,8],[56,2,56,6],[57,2,57,6],[58,7,58,8],[59,2,59,8],[41,2,41,8],[31,2,31,8],[32,2,32,6],[34,7,34,8],[1,1,2,6],[12,2,12,5],[12,7,12,8],[8,1,8,8],[9,2,9,5],[9,7,9,8],[6,2,6,5],[6,7,6,8],[10,2,10,5],[10,7,10,8],[17,2,17,8],[21,2,21,8]]}
[1,null,null,null,null,null,null,{"$f":"IFERROR(VLOOKUP($C$7,Dt!AD81:AE83,2,0),\"INV\")","v":"PAZ"},{"$f":"IFERROR(VLOOKUP($C$13,Dt!$AC$6:$AD$13,2,0),\"NT\")","v":"NT"},null,null,null,null,null,null,null,null,null,null,null,null,null,null,"Número de Paginas del documento final , se puede ajustar."]
[null,"PRESENTACIÓN DE PROYECTOS \nDE INVESTIGACIÓN",null,null,null,null,null,"Fecha de Emisión: 2019/03/18","IN-IV-F-14",null,null,null,null,null,null,null,null,null,".",null,null,null,null,11,null,null,"NN","No. Grupo"]
[null,null,null,null,null,null,null,"Revisión N°:\n4",{"$f":"\"Página \"&A1&\" de \"&Dt_TPG","v":"Página 1 de 11"},null,null,null,null,null,null,null,null,null,"Documento de Prueba 06 Marzo 2018",null,null,null,null,null,null,null,44,{"$f":"VLOOKUP($AA3,Dt!$AN$3:$AR$76,3,0)","v":"ACCEDER"}]
[null,null,null,null,null,null,null,null,null,null,null,null,null,null,null,null,null,null,null,null,null,null,null,null,null,null,45,{"$f":"VLOOKUP($AA4,Dt!$AN$3:$AR$76,3,0)","v":"Agua y Energía - AyE"}]
["1.-","Información general del proyecto.",null,null,null,null,null,null,{"$f":"\"Vrs.- \"&TEXT(DAY($U$5),\"00\")&\".\"&(TEXT(MONTH($U$5),\"00\"))&U7","v":"Vrs.- 05.09"},null,null,null,null,null,null,null,null,null,"Fecha Actualización ",null,{"$f":"I73","v":"2019-09-05"},null,null,"Hoy es ",null,null,10,{"$f":"VLOOKUP($AA5,Dt!$AN$3:$AR$76,3,0)","v":"Agrobiología de especies vegetales promisorias de clima frío"}]
[null,null,null,null,null,null,null,null,null,null,null,null,null,null,null,null,null,null,null,null,null,null,null,null,null,null,34,{"$f":"VLOOKUP($AA6,Dt!$AN$3:$AR$76,3,0)","v":"BioethicsGroup"}]
{"$rows_left_out":91}
{"sheet":"Resumen","index":2,"n_rows":55,"n_cols":18,"rows_kept":55,"cut":false,"hidden":false,"merged":[[25,2,25,4],[1,2,2,2],[6,2,6,4],[24,2,24,4],[18,2,18,4],[17,2,17,4],[11,2,11,4],[10,2,10,4],[9,2,9,4],[8,2,8,4],[7,2,7,4],[12,2,12,4],[13,2,13,4],[14,2,14,4],[43,2,43,4],[26,2,26,4],[27,2,27,4],[28,2,28,4],[29,2,29,4],[41,3,41,4],[40,3,40,4],[38,2,38,4],[30,2,30,4],[31,2,31,4],[32,2,32,4],[33,2,33,4]]}
[2,null,null,null,null,null,"*Pueden  Ocultar las Filas que no se utilicen.",null,null,null,null,null,null,null,null,null,null,"https://www.ealde.es/niveles-riesgo-niveles-control/"]
[null,null,{"$f":"General!B2","v":"PRESENTACIÓN DE PROYECTOS \nDE INVESTIGACIÓN"},{"$f":"General!$H$2","v":"Fecha de Emisión: 2019/03/18"},{"$f":"General!$I$2","v":"IN-IV-F-14"},null,{"$f":"SUM(G7:G19)","v":0},"<=== N° palabras en total"]
[null,null,null,{"$f":"General!$H$3","v":"Revisión N°:\n4"},{"$f":"\"Página \"&A1&\" de \"&Dt_TPG","v":"Página 2 de 11"},null,"Palabras","Largo L"]
[]
["4.-","#","Resumen de la propuesta .",null,null,null,{"$f":"SUM(G6:G20)","v":0},{"$f":"SUM(H6:H20)","v":0}]
[]
{"$rows_left_out":50}
{"sheet":"Estado_del_arte","index":3,"n_rows":68,"n_cols":8,"rows_kept":68,"cut":false,"hidden":false,"merged":[[63,2,63,4],[1,2,2,2],[58,2,58,4],[59,2,59,4],[60,2,60,4],[61,2,61,4],[18,2,18,4],[19,2,19,4],[20,2,20,4],[21,2,21,4],[50,2,50,4],[51,2,51,4],[12,2,12,4],[13,2,13,4],[14,2,14,4],[15,2,15,4],[62,2,62,4],[52,2,52,4],[53,2,53,4],[54,2,54,4],[55,2,55,4],[56,2,56,4],[57,2,57,4],[44,2,44,4],[45,2,45,4],[49,2,49,4],[11,2,11,4],[6,2,6,4],[7,2,7,4],[8,2,8,4],[9,2,9,4],[10,2,10,4],[16,2,16,4],[17,2,17,4],[38,2,38,4],[46,2,46,4],[47,2,47,4],[48,2,48,4],[39,2,39,4],[40,2,40,4],[41,2,41,4],[42,2,42,4],[43,2,43,4],[35,2,35,4],[36,2,36,4],[37,2,37,4],[22,2,22,4],[23,2,23,4],[24,2,24,4],[25,2,25,4],[26,2,26,4],[32,2,32,4],[33,2,33,4],[34,2,34,4],[27,2,27,4],[28,2,28,4],[29,2,29,4],[30,2,30,4],[31,2,31,4]]}
[3,null,null,null,null,null,"*Pueden  Ocultar las Filas que no se utilicen."]
[null,null,{"$f":"General!B2","v":"PRESENTACIÓN DE PROYECTOS \nDE INVESTIGACIÓN"},{"$f":"General!$H$2","v":"Fecha de Emisión: 2019/03/18"},{"$f":"General!$I$2","v":"IN-IV-F-14"}]
[null,null,null,{"$f":"General!$H$3","v":"Revisión N°:\n4"},{"$f":"\"Página \"&A1&\" de \"&Dt_TPG","v":"Página 3 de 11"},null,{"$f":"SUM(G7:G3528)","v":5},"<== Total de palabras"]
[]
["6.-","#","Estado del arte de la propuesta o  antecedentes.",null,null,null,"Largo"]
[]
{"$rows_left_out":63}
{"sheet":"Objetivos","index":4,"n_rows":31,"n_cols":8,"rows_kept":31,"cut":false,"hidden":false,"merged":[[18,2,18,4],[17,2,17,4],[22,2,22,4],[21,2,21,4],[20,2,20,4],[19,2,19,4],[1,1,2,2],[7,2,7,4],[8,2,8,4],[9,2,9,4],[10,2,10,4],[6,1,6,4],[11,2,11,4],[13,2,13,4],[14,2,14,4],[15,2,15,4],[16,2,16,4],[12,2,12,4]]}
[4]
[null,{"$f":"General!B2","v":"PRESENTACIÓN DE PROYECTOS \nDE INVESTIGACIÓN"},null,{"$f":"General!$H$2","v":"Fecha de Emisión: 2019/03/18"},{"$f":"General!$I$2","v":"IN-IV-F-14"}]
[null,null,null,{"$f":"General!$H$3","v":"Revisión N°:\n4"},{"$f":"\"Página \"&A1&\" de \"&Dt_TPG","v":"Página 4 de 11"},null,{"$f":"SUM(G7:G3500)","v":0},"<== Total de palabras"]
[]
["7.-","Objetivos de la propuesta.",null,null,null,null,"Largo"]
[]
{"$rows_left_out":26}
{"sheet":"Metodología","index":5,"n_rows":41,"n_cols":8,"rows_kept":41,"cut":false,"hidden":false,"merged":[[34,2,34,4],[1,2,2,2],[28,2,28,4],[29,2,29,4],[30,2,30,4],[31,2,31,4],[12,2,12,4],[13,2,13,4],[14,2,14,4],[15,2,15,4],[16,2,16,4],[17,2,17,4],[6,2,6,4],[7,2,7,4],[8,2,8,4],[9,2,9,4],[10,2,10,4],[11,2,11,4],[18,2,18,4],[19,2,19,4],[20,2,20,4],[21,2,21,4],[22,2,22,4],[23,2,23,4],[24,2,24,4],[33,2,33,4],[32,2,32,4],[27,2,27,4],[26,2,26,4],[25,2,25,4]]}
[5,null,null,null,null,null,"*Pueden  Ocultar las Filas que no se utilicen."]
[null,null,{"$f":"General!B2","v":"PRESENTACIÓN DE PROYECTOS \nDE INVESTIGACIÓN"},{"$f":"General!$H$2","v":"Fecha de Emisión: 2019/03/18"},{"$f":"General!$I$2","v":"IN-IV-F-14"}]
[null,null,null,{"$f":"General!$H$3","v":"Revisión N°:\n4"},{"$f":"\"Página \"&A1&\" de \"&Dt_TPG","v":"Página 5 de 11"},null,{"$f":"SUM(G7:G3501)","v":0},"<== Total de palabras"]
[]
["8.-","#","Metodología de la propuesta.",null,null,null,"Largo"]
[]
{"$rows_left_out":36}
{"sheet":"Etica","index":6,"n_rows":71,"n_cols":17,"rows_kept":71,"cut":false,"hidden":false,"merged":[[67,2,67,4],[1,2,2,2],[6,2,6,3],[27,2,27,3],[40,2,40,3],[47,2,47,3],[41,2,41,3],[43,2,43,3],[45,2,45,3],[10,2,10,4],[12,2,12,4],[14,2,14,4],[16,2,16,4],[18,2,18,4],[20,2,20,4],[22,2,22,4],[24,2,24,4],[19,2,19,3],[21,2,21,3],[8,2,8,4],[52,2,52,3],[25,2,25,3],[28,2,28,3],[30,2,30,3],[32,2,32,3],[36,2,36,3],[38,2,38,3],[26,2,26,4],[29,2,29,4],[31,2,31,4],[33,2,33,4],[35,2,35,4],[7,2,7,3],[11,2,11,3],[13,2,13,3],[15,2,15,3],[17,2,17,3],[56,2,56,4],[58,2,58,4],[60,2,60,4],[64,2,64,3],[62,2,62,4],[65,2,65,4],[37,2,37,4],[39,2,39,4],[42,2,42,4],[44,2,44,4],[46,2,46,4],[61,2,61,3],[48,2,48,3],[50,2,50,3],[53,2,53,3],[55,2,55,3],[57,2,57,3],[59,2,59,3],[49,2,49,4],[51,2,51,4],[54,2,54,4]]}
[5,null,null,null,null,null,"*Pueden  Ocultar las Filas que no se utilicen."]
[null,null,{"$f":"General!B2","v":"PRESENTACIÓN DE PROYECTOS \nDE INVESTIGACIÓN"},{"$f":"General!$H$2","v":"Fecha de Emisión: 2019/03/18"},{"$f":"General!$I$2","v":"IN-IV-F-14"},null,null,null,null,"Detalles:"]
[null,null,null,{"$f":"General!$H$3","v":"Revisión N°:\n4"},{"$f":"\"Página \"&A1&\" de \"&Dt_TPG","v":"Página 5 de 11"},null,{"$f":"SUM(G5:G3524)","v":445},"<== Total de palabras"]
[]
[null,null,{"$f":"$Q$13","v":"."}]
["8b.-",0,"Consideraciones e implicaciones éticas de la investigación, bioética e integridad científica",null,"( Si  / No  )",null,"Palabras",null,null,null,null,null,"Validaciones"]
{"$rows_left_out":66}
{"sheet":"Cronograma","index":7,"n_rows":33,"n_cols":12,"rows_kept":33,"cut":false,"hidden":false,"merged":[[1,1,2,2]]}
[6,null,null,null,null,null,null,null,"*Pueden  Ocultar las Filas que no se utilicen.",null,null,{"$f":"(\"* Actualmente tiene \"&G7&\" meses de ejecución no superar los \"& G5&\" meses.\")","v":"* Actualmente tiene 12 meses de ejecución no superar los 24 meses."}]
[null,{"$f":"General!B2","v":"PRESENTACIÓN DE PROYECTOS \nDE INVESTIGACIÓN"},null,{"$f":"General!$H$2","v":"Fecha de Emisión: 2019/03/18"},{"$f":"General!$I$2","v":"IN-IV-F-14"}]
[null,null,null,{"$f":"General!$H$3","v":"Revisión N°:\n4"},{"$f":"\"Página \"&A1&\" de \"&Dt_TPG","v":"Página 6 de 11"}]
[]
["9.-","Cronograma de actividades a desarrollar",null,null,{"$f":"Integrantes!J6","v":24},null,{"$f":"E5","v":24},"Meses Maximo","Palabras"]
[]
{"$rows_left_out":28}
{"sheet":"Crono","index":8,"n_rows":30,"n_cols":17,"rows_kept":30,"cut":false,"hidden":true,"merged":[[1,1,2,14]]}
[6]
[null,{"$f":"General!B2","v":"PRESENTACIÓN DE PROYECTOS \nDE INVESTIGACIÓN"},null,null,null,null,null,null,null,null,null,null,null,null,null,{"$f":"General!$H$2","v":"Fecha de Emisión: 2019/03/18"},{"$f":"General!$I$2","v":"IN-IV-F-14"}]
[null,null,null,null,null,null,null,null,null,null,null,null,null,null,null,{"$f":"General!$H$3","v":"Revisión N°:\n4"},{"$f":"\"Página \"&A1&\" de \"&Dt_TPG","v":"Página 6 de 11"}]
[]
["9.-","Cronograma de actividades a desarrollar"]
[]
{"$rows_left_out":25}
{"sheet":"Integrantes","index":9,"n_rows":52,"n_cols":31,"rows_kept":52,"cut":false,"hidden":false,"merged":[[24,25,24,26],[25,5,25,7],[29,5,29,7],[33,5,33,7],[24,1,27,1],[26,3,26,7],[28,1,31,1],[30,3,30,7],[32,1,35,1],[27,3,27,7],[31,3,31,7],[35,3,35,7],[13,5,13,7],[21,5,21,7],[17,5,17,7],[8,1,11,1],[12,1,15,1],[14,3,14,7],[16,1,19,1],[18,3,18,7],[20,1,23,1],[22,3,22,7],[11,3,11,7],[15,3,15,7],[19,3,19,7],[23,3,23,7],[2,1,3,4],[2,6,2,7],[3,6,3,7],[9,5,9,7],[10,3,10,7],[44,1,47,1],[46,3,46,7],[34,3,34,7],[36,1,39,1],[38,3,38,7],[40,1,43,1],[42,3,42,7],[41,5,41,7],[45,5,45,7],[37,5,37,7],[39,3,39,7],[43,3,43,7],[47,3,47,7]]}
[8]
[]
[null,{"$f":"Productos!B2","v":"PRESENTACIÓN DE PROYECTOS \nDE INVESTIGACIÓN"},null,null,null,{"$f":"General!$H$2","v":"Fecha de Emisión: 2019/03/18"},"IN-IV-F-14",null,null,null,null,null,"Ok","Puntos","IP Max","IP Min","CO Max","CO Min","CR"]
[null,null,null,null,null,{"$f":"General!$H$3","v":"Revisión N°:\n4"},{"$f":"\"Página \"&A1&\" de \"&Dt_TPG","v":"Página 8 de 11"},{"$f":"\"Página \"&A2&\" de \"&Dt_TPG","v":"Página  de 11"},null,20,null,null,1,{"$f":"S8","v":0},{"$f":"VLOOKUP($M$4,$M$8:$T$23,3,0)","v":40},{"$f":"VLOOKUP($M$4,$M$8:$T$23,4,0)","v":0},{"$f":"VLOOKUP($M$4,$M$8:$T$23,5,0)","v":40},{"$f":"VLOOKUP($M$4,$M$8:$T$23,6,0)","v":0},{"$f":"VLOOKUP($M$4,$M$8:$T$23,2,0)","v":20},{"$f":"VLOOKUP($M$4,$M$8:$T$23,8,0)","v":25}]
[]
["11.-","Investigadores Integrantes del proyecto.",null,null,null,{"$f":"Cel_TP","v":"PAZ"},{"$f":"Cel_Fac","v":"NT"},{"$f":"V_Max","v":0},null,{"$f":"IF(F6=\"INV\",12,24)","v":24},null,null,null,null,null,null,null,null,null,null,null,null,"* Cuadro para tener relación entre Fincion y Tipo de Vinculo"]
{"$rows_left_out":47}
{"sheet":"Productos","index":10,"n_rows":112,"n_cols":27,"rows_kept":112,"cut":false,"hidden":false,"merged":[[36,2,36,5],[37,2,37,5],[38,2,38,5],[39,2,39,5],[40,2,40,5],[1,1,2,5],[32,2,32,5],[33,2,33,5],[34,2,34,5],[35,2,35,5]]}
[7]
[null,{"$f":"Cronograma!B2","v":"PRESENTACIÓN DE PROYECTOS \nDE INVESTIGACIÓN"},null,null,null,null,{"$f":"General!$H$2","v":"Fecha de Emisión: 2019/03/18"},{"$f":"General!$I$2","v":"IN-IV-F-14"}]
[null,null,null,null,null,null,{"$f":"General!$H$3","v":"Revisión N°:\n4"},{"$f":"\"Página \"&A1&\" de \"&Dt_TPG","v":"Página 7 de 11"},{"$f":"IF(H5=\"INV\",4,5)","v":5},null,"N","Cod","Abreviatura","IdClase","INV","IMP","Clase ","Tipo de Productos","Indicadores","o","Ok","IdClase"]
[null,null,null,null,null,null,{"$f":"IF(H5=\"INV\",3,4)","v":4},null,null,null,{"$f":"ROW()-3","v":1},101,"101-Libro","GNC",1,1,"Productos Generacion Nuevo Conocimiento (Minimo 3 productos).",null,"Soportes de sometimiento Evaluation positiva del libro por parte de los pares academicos",null,null,0]
["10.-","Productividad comprometida",null,null,null,"Tipo de proyecto:",null,{"$f":"General!$H$1","v":"PAZ"},null,null,{"$f":"ROW()-3","v":2},102,"102-Capitulo de libro","GNC",1,1,"Productos Generacion Nuevo Conocimiento (Minimo 3 productos).",null,"Soportes de sometimiento Copia del capitulo, portada y pagina legal del libro en el que fue publicado.",null,null,0]
[null,null,"Selección de topes comprometidos",null,null,null,null,null,null,null,3,103,"103-Articulo en revista cientifica","GNC",1,1,"Productos Generacion Nuevo Conocimiento (Minimo 3 productos).",null,"Soportes de sometimiento, aceptacion y/o publicacion.",null,null,0]
{"$rows_left_out":107}
{"sheet":"Presupuesto","index":11,"n_rows":184,"n_cols":29,"rows_kept":184,"cut":false,"hidden":false,"merged":[[113,4,113,5],[108,4,108,5],[109,4,109,5],[110,4,110,5],[111,4,111,5],[112,4,112,5],[103,4,103,5],[104,4,104,5],[105,4,105,5],[106,4,106,5],[107,4,107,5],[98,4,98,5],[99,4,99,5],[100,4,100,5],[101,4,101,5],[102,4,102,5],[93,4,93,5],[94,4,94,5],[95,4,95,5],[96,4,96,5],[97,4,97,5],[161,1,163,1],[175,4,176,8],[173,4,173,8],[175,3,176,3],[140,1,142,1],[143,1,145,1],[146,1,148,1],[149,1,151,1],[155,1,157,1],[152,1,154,1],[158,1,160,1],[125,1,127,1],[128,1,130,1],[131,1,133,1],[134,1,136,1],[137,1,139,1],[2,1,3,6],[49,4,49,5],[50,4,50,5],[69,4,69,5],[68,4,68,5],[6,3,6,8],[7,3,7,5],[7,7,7,8],[51,4,51,5],[52,4,52,5],[53,4,53,5],[54,4,54,5],[55,4,55,5],[56,4,56,5],[57,4,57,5],[58,4,58,5],[59,4,59,5],[60,4,60,5],[61,4,61,5],[67,4,67,5],[62,4,62,5],[63,4,63,5],[64,4,64,5],[65,4,65,5],[66,4,66,5],[70,4,70,5],[71,4,71,5],[72,4,72,5],[73,4,73,5],[74,4,74,5],[75,4,75,5],[76,4,76,5],[77,4,77,5],[78,4,78,5],[79,4,79,5],[80,4,80,5],[81,4,81,5],[82,4,82,5],[83,4,83,5],[84,4,84,5],[121,4,121,5],[116,4,116,5],[117,4,117,5],[118,4,118,5],[119,4,119,5],[120,4,120,5]]}
[9,null,null,null,null,null,null,null,null,null,null,null,null,null,null,null,null,"Tabla de Topes"]
[null,null,null,null,null,null,null,null,null,null,null,null,"1.-> Limite presupuestal",{"$f":"IF(MIN(N6:P6)<1, 0,MIN(N6:P6))","v":0},null,null,null,"Clasif",null,null,null,{"$f":"General!I19","v":"C"}]
[null,{"$f":"Integrantes!B3","v":"PRESENTACIÓN DE PROYECTOS \nDE INVESTIGACIÓN"},null,null,null,null,null,{"$f":"General!$H$2","v":"Fecha de Emisión: 2019/03/18"},{"$f":"General!$I$2","v":"IN-IV-F-14"},null,null,null,null,"Limite Grupo","Limite Producto","Limite Convo",null,"A",{"$f":"IF($H$10=\"IMP\",250,100)","v":100},null,null,{"$f":"General!I23","v":""}]
[null,null,null,null,null,null,null,{"$f":"General!$H$3","v":"Revisión N°:\n4"},{"$f":"\"Página \"&$A$1&\" de \"&Dt_TPG","v":"Página 9 de 11"},null,null,null,"Mayor Grupo",{"$f":"Productos!G97","v":"C"},{"$f":"Productos!M61","v":80},{"$f":"IF(H10=\"IMP\",250,100)","v":100},null,"A1",{"$f":"IF($H$10=\"IMP\",250,100)","v":100},null,null,{"$f":"General!I27","v":""}]
[null,null,null,null,null,null,null,null,null,null,null,null,null,null,null,null,null,"B",{"$f":"IF($H$10=\"IMP\",250,100)","v":100}]
[null,null,null,null,null,null,null,null,null,null,null,null,1000000,{"$f":"IF(N7>2,P6,0)","v":70000000},{"$f":"IF(O7=3,P6,0)","v":0},70000000,null,"C",{"$f":"IF($H$10=\"IMP\",250,100)","v":100}]
{"$rows_left_out":179}
{"sheet":"Impactos","index":12,"n_rows":41,"n_cols":14,"rows_kept":41,"cut":false,"hidden":false,"merged":[[17,2,17,6],[18,2,18,6],[8,5,8,6],[22,2,22,6],[19,2,19,6],[20,2,20,6],[15,2,15,6],[16,2,16,6],[21,2,21,6],[1,2,2,4],[13,2,13,3],[13,4,13,6],[12,2,12,3],[12,4,12,6],[7,5,7,6],[11,2,11,6],[9,2,9,6]]}
[10,null,null,null,null,null,null,null,"*Pueden  Ocultar las Filas que no se utilicen."]
[null,null,{"$f":"General!B2","v":"PRESENTACIÓN DE PROYECTOS \nDE INVESTIGACIÓN"},null,null,{"$f":"General!$H$2","v":"Fecha de Emisión: 2019/03/18"},{"$f":"General!$I$2","v":"IN-IV-F-14"},null,null,"Palabras Minimas",null,null,2000]
[null,null,null,null,null,{"$f":"General!$H$3","v":"Revisión N°:\n4"},{"$f":"\"Página \"&$A$1&\" de \"&Dt_TPG","v":"Página 10 de 11"},null,{"$f":"SUM(I7:I3502)","v":82},"<== Total de palabras",null,null,"Tipo de Impacto (Objetivos de Desarrollo Sostenible): Link Presione"]
[]
["14.-","#","Impactos asociados a la propuesta.",null,null,null,null,null,"Largo"]
[null,null,null,null,null,null,null,null,null,null,null,null,"Esplicaciones"]
{"$rows_left_out":36}
{"sheet":"Bibliografía","index":13,"n_rows":39,"n_cols":8,"rows_kept":39,"cut":false,"hidden":false,"merged":[[34,2,34,4],[23,2,23,4],[24,2,24,4],[25,2,25,4],[26,2,26,4],[27,2,27,4],[28,2,28,4],[29,2,29,4],[30,2,30,4],[31,2,31,4],[32,2,32,4],[33,2,33,4],[22,2,22,4],[11,2,11,4],[12,2,12,4],[13,2,13,4],[14,2,14,4],[15,2,15,4],[16,2,16,4],[17,2,17,4],[18,2,18,4],[19,2,19,4],[20,2,20,4],[21,2,21,4],[10,2,10,4],[1,2,2,2],[6,2,6,4],[7,2,7,4],[8,2,8,4],[9,2,9,4]]}
[11,null,null,null,null,null,"*Pueden  Ocultar las Filas que no se utilicen."]
[null,null,{"$f":"General!B2","v":"PRESENTACIÓN DE PROYECTOS \nDE INVESTIGACIÓN"},{"$f":"General!$H$2","v":"Fecha de Emisión: 2019/03/18"},{"$f":"General!$I$2","v":"IN-IV-F-14"}]
[null,null,null,{"$f":"General!$H$3","v":"Revisión N°:\n4"},{"$f":"\"Página \"&$A$1&\" de \"&Dt_TPG","v":"Página 11 de 11"},null,{"$f":"SUM(G7:G3500)","v":0},"<== Total de palabras"]
[]
["15.-","#","Bibliografía de la propuesta.",null,null,null,"Largo"]
[]
{"$rows_left_out":33}