{"text_format":"1","workbook":"xlsx","n_sheets":17,"sheets":["Dt","Datos_Generales","Resumen","Descripción","Objetivos","Metodología","Estado_del_Arte","Marco_Teorico","Cronograma","PD","Integrantes","Presupuesto","Grupo","Impactos","Biblografia","Imagenes","Normas"],"not_rendered":{"charts":0,"images":2,"macros":0,"external_links":0,"defined_names":53,"comments":14,"pivot_tables":0},"unopened":[],"bounds":{"document_bytes":16777216,"sheet_cells":100000,"rows_first":2000,"rows_last":500,"rows_between":2000,"halvings":0,"cell_chars":16384,"cell_head_chars":4096},"cells_cut":0,"cells_raw":0,"read":"whole","date_system":"1900"}

{"sheet":"Dt","index":0,"n_rows":334,"n_cols":71,"rows_kept":334,"cut":false,"hidden":true,"merged":[]}
[null,"No ","Min Pts","Max Pts","Valor en Millones","Abreviatura","Clasificación","Tipo de Entidad","Tipo 2","SIoNo","Convocatoria","IDPRY","Tiempo","Max Presu","Tipo de Impacto","SEDES","Tipo de Proyecto:","Tipos de Productos ","Facultad","Nivel Estudios","Vinculo con la UMNG","FuncionProyecto","Tipo De Impacto","NBC","ID NBC",null,null,null,null,null,null,null,null,null,null,null,null,null,null,null,null,null,"http://scienti.colciencias.gov.co:8080/gruplac/jsp/visualiza/visualizagr.jsp?nro=",null,null,null,null,null,null,null,null,null,null,null,null,null,null,null,null,null,"Ap"]
[null,1,20,39.9,25,"Articulo Q1","A1","Institución Pública","Centro de investigacion ","Si","Proyecto de Iniciación Cientifica PIC","PIC",5,1,"Ambiental","Bogotá","Investigación Básica","Generación ","Ciencias Básicas y Aplicadas","Técnico ","Doc. Carrera TC","Investigador Principal","Ambiental","Programas y certificaciones básicas",11,null,null,null,null,null,null,null,null,null,null,null,null,null,null,null,null,null,null,null,null,"BB",null,{"$f":"MIN(BD3:BD298)","v":4},{"$f":"MAX(BD3:BD298)","v":298},null,null,null,null,null,null,null,null,null,null,"Facultades","Rutas","Mins","Maxs",null,null,null,null,null,null,"Clave","VICEINUMNG2014"]
[null,2,40,59.9,50,"Articulo Q2","B","Institución Privada","Centro de desarrollo tecnológico","No","Proyecto de Investigación Científica","INV",12,60,"Salud Humana","Campus Nueva Granada","Investigación Aplicada","Fortalecimiento","Derecho","Pregrado","Doc. Carrera MT","Coinvestigador ","Competividad","Alfabetización y aritmética elemental",21,null,null,null,null,null,null,null,null,null,null,null,null,null,null,"Hoja","FAC","Grupo","COD","Clas","Link","Lineas","Fila Grupo","Min","Max","FAC",null,null,"COD","Linea (Act: 13 Sep 2022)","Cel","Fila","E:Gp",null,null,"CIAS",{"$f":"\"DT!\"&$BI$1&$BJ3&\":\"&$BI$1&$BK3","v":"DT!Ap4:Ap20"},{"$f":"MINA(IF($BH3=$AX$3:$AX$80,$AU$3:$AU$80))","v":4},{"$f":"MAXA(IF($BH3=$AX$3:$AX$80,$AU$3:$AU$80))","v":20}]
[null,3,60,79.900000000000006,75,"Articulo A1","C","Sector Defensa",null,null,"Proyecto de Alto Impacto","IMP",24,200,"Seres Vivos",null,"Desarrollo Tecnológico o Experimental\n","Apropiacion","Estudios a Distancia ","Posgrado","Doc. Ocasional","Asistente Investigación","Económico","Competencias personales y desarrollo",31,null,null,null,null,null,null,null,null,null,null,null,null,1,{"$f":"COUNTIF($AN$4:$AN$75,AL4)","v":1},1,"CIAS","Fitoplasmas y Virus","COL0028687","B","https://scienti.minciencias.gov.co/gruplac/jsp/visualiza/visualizagr.jsp?nro=00000000008436",{"$f":"$AT$2&AV4&\":\"&$AT$2&AW4","v":"BB256:BB257"},{"$f":"ROW()","v":4},{"$f":"MINA(IF(AQ4=$BA$4:$BA$419,$BD$4:$BD$419))","v":256},{"$f":"MAXA(IF(AQ4=$BA$4:$BA$419,$BD$4:$BD$419))","v":257},{"$f":"AO4","v":"CIAS"},null,null,"COL0178619","Modelos de simulación",{"$f":"COUNTIF(BA$4:BA4,BA4)","v":1},{"$f":"ROW()","v":4},{"$f":"COUNTIF($AQ$3:$AQ$84,BA4)","v":1},null,null,"DER","DT!Ap21:Ap23",{"$f":"MINA(IF($BH4=$AX$3:$AX$80,$AU$3:$AU$80))","v":21},{"$f":"MAXA(IF($BH4=$AX$3:$AX$80,$AU$3:$AU$80))","v":23}]
[null,4,80,199.9,100,"Articulo A2","D",null,null,null,null,null,null,null,"Económico ",null,"No Aplica",null,"Ciencias Económicas ","Tecnólogia","Estudiante","Joven Investigador","Productividad","Ciencias de la educación",111,null,null,null,null,null,null,null,null,null,null,null,null,2,1,2,"CIAS","Grupo de investigación en Biodiversidad y ecología de abejas silvestres","COL0031959","B","https://scienti.minciencias.gov.co/gruplac/jsp/visualiza/visualizagr.jsp?nro=00000000001366","BB109:BB113",5,{"$f":"MINA(IF(AQ5=$BA$4:$BA$419,$BD$4:$BD$419))","v":109},{"$f":"MAXA(IF(AQ5=$BA$4:$BA$419,$BD$4:$BD$419))","v":113},"CIAS",null,null,"COL0178619","Bioinnovación y educación",{"$f":"COUNTIF(BA$4:BA5,BA5)","v":2},{"$f":"ROW()","v":5},1,null,null,"DIS","DT!Ap24:Ap30",{"$f":"MINA(IF($BH5=$AX$3:$AX$80,$AU$3:$AU$80))","v":24},{"$f":"MAXA(IF($BH5=$AX$3:$AX$80,$AU$3:$AU$80))","v":30}]
[null,5,200,1000,{"$f":"125*2","v":250},"Articulo B","Reconocido",null,null,null,null,null,null,null,"Social",null,null,null,"Educación y Humanidades","Especialización","OPS - Prestación Servicios","Estudiante","Social","Formación para docentes de educación pre-primaría",112,null,null,null,null,null,null,null,null,null,null,null,null,3,1,3,"CIAS","MATRIX","COL0039321","B","https://scienti.minciencias.gov.co/gruplac/jsp/visualiza/visualizagr.jsp?nro=00000000002208","BB278:BB282",6,{"$f":"MINA(IF(AQ6=$BA$4:$BA$419,$BD$4:$BD$419))","v":278},{"$f":"MAXA(IF(AQ6=$BA$4:$BA$419,$BD$4:$BD$419))","v":282},"CIAS",null,null,"COL0178619","Biología de poblaciones y evolutiva de plantas, animales y microorganismos",{"$f":"COUNTIF(BA$4:BA6,BA6)","v":3},{"$f":"ROW()","v":6},1,null,null,"ECO","DT!Ap31:Ap34",{"$f":"MINA(IF($BH6=$AX$3:$AX$80,$AU$3:$AU$80))","v":31},{"$f":"MAXA(IF($BH6=$AX$3:$AX$80,$AU$3:$AU$80))","v":34}]
[null,6,null,null,null,"Articulo C",null,null,null,null,null,null,null,null,"Otros",null,null,null,"Ingeniería ","Maestria","Externo a la UMNG","Técnico","Institucional","Formación para docentes sin asignatura de especialización",113,null,null,null,null,null,null,null,null,null,null,null,null,4,1,4,"CIAS","Control Biológico UMNG","COL0032278","A","https://scienti.minciencias.gov.co/gruplac/jsp/visualiza/visualizagr.jsp?nro=00000000001399","BB302:BB304",7,{"$f":"MINA(IF(AQ7=$BA$4:$BA$419,$BD$4:$BD$419))","v":302},{"$f":"MAXA(IF(AQ7=$BA$4:$BA$419,$BD$4:$BD$419))","v":304},"CIAS",null,null,"COL0178619","Ecofisiología vegetal, animal y microbiana",{"$f":"COUNTIF(BA$4:BA7,BA7)","v":4},{"$f":"ROW()","v":7},1,null,null,"EES","DT!Ap35:Ap36",{"$f":"MINA(IF($BH7=$AX$3:$AX$80,$AU$3:$AU$80))","v":35},{"$f":"MAXA(IF($BH7=$AX$3:$AX$80,$AU$3:$AU$80))","v":36}]
[null,7,null,null,null,"Libro Completo",null,null,null,null,null,null,null,null,null,null,null,null,"Medicina y Ciencias de la Salud","Doctorado",null,"Investigador Principal","Areas de Salud","Formación para docentes con asignatura de especialización",114,null,null,null,null,null,null,null,null,null,null,null,null,5,1,5,"CIAS","Grupo de Micología y Fitopatologia ","COL0013719","A1","https://scienti.minciencias.gov.co/gruplac/jsp/visualiza/visualizagr.jsp?nro=00000000001127","BB154:BB158",8,{"$f":"MINA(IF(AQ8=$BA$4:$BA$419,$BD$4:$BD$419))","v":154},{"$f":"MAXA(IF(AQ8=$BA$4:$BA$419,$BD$4:$BD$419))","v":158},"CIAS",null,null,"COL0178619","Servicios ecosistèmicos",{"$f":"COUNTIF(BA$4:BA8,BA8)","v":5},{"$f":"ROW()","v":8},1,null,null,"HUM","DT!Ap37:Ap40",{"$f":"MINA(IF($BH8=$AX$3:$AX$80,$AU$3:$AU$80))","v":37},{"$f":"MAXA(IF($BH8=$AX$3:$AX$80,$AU$3:$AU$80))","v":40}]
{"$rows_left_out":327}
{"sheet":"Datos_Generales","index":1,"n_rows":72,"n_cols":19,"rows_kept":72,"cut":false,"hidden":false,"merged":[[14,3,14,4],[44,2,44,3],[44,4,44,7],[45,2,45,3],[15,3,15,4],[15,6,15,7],[18,2,19,5],[21,3,21,7],[23,6,23,7],[25,6,25,7],[35,4,35,6],[37,3,37,7],[2,1,3,7],[9,3,9,7],[10,4,10,7],[11,3,11,7],[13,3,13,4],[13,6,13,7]]}
[10,11,"2016-07-07"]
[]
[null,"PRESENTACIÓN DE PROYECTOS \nDE INICIACIÓN CIENTIFÍCA 2023 - 2"]
[]
[null,null,null,null,null,null,null,null,null,null,"No","Hoja ","Validacion","Pendientes"]
[null,null,"Datos digilenciados VICIEIN.",null,"Código :",null,"Radicado :",null,null,null,1,"Datos Generales","Datos Generales sin llenar. = > >",{"$f":"SUM(I8:I45)","v":7}]
[]
[null,"1.","INFORMACION GENERAL DEL PROYECTO:",null,null,"Vrs.03.23","Facultad  :",null,{"$f":"IF(H8=0,1,\"\")","v":1},null,2,"Resumen","Hay textos en resumen",{"$f":"IF(Resumen!K4>0,\"OK :\"&Resumen!K4&\" Lt:\"&Resumen!K5,\"Falta\")","v":"Falta"}]
{"$rows_left_out":65}
{"sheet":"Resumen","index":2,"n_rows":18,"n_cols":12,"rows_kept":18,"cut":false,"hidden":false,"merged":[[14,2,14,7],[15,2,15,7],[16,2,16,7],[17,2,17,7],[3,1,4,7],[8,2,8,7],[9,2,9,7],[10,2,10,7],[11,2,11,7],[12,2,12,7],[13,2,13,7]]}
[]
[]
[]
[null,{"$f":"Datos_Generales!B3","v":"PRESENTACIÓN DE PROYECTOS \nDE INICIACIÓN CIENTIFÍCA 2023 - 2"},null,null,null,null,null,null,null,null,{"$f":"COUNTIF(C9:H80,\"<>\"&\"\")","v":0},"=> Numero de resgistros de resumenes diligenciados."]
[null,null,null,null,null,null,null,null,null,null,{"$f":"SUM(K9:K80)","v":0},"=> Numero de caracteres diligenciados"]
[null,null,null,null,null,null,null,null,null,null,"Tener en cuenta "]
[null,"6.","Resumen de Proyecto - Maximo 500 Caracteres.",null,null,null,null,null,null,null,"No debe tener mas de 999 caracteres por celda o de largo"]
[null,null,null,null,null,null,null,null,null,null,"Validación en número de caracteres"]
{"$rows_left_out":11}
{"sheet":"Descripción","index":3,"n_rows":25,"n_cols":12,"rows_kept":25,"cut":false,"hidden":false,"merged":[[13,2,13,7],[14,2,14,7],[22,2,22,7],[23,2,23,7],[24,2,24,7],[15,2,15,7],[16,2,16,7],[17,2,17,7],[18,2,18,7],[19,2,19,7],[20,2,20,7],[21,2,21,7],[3,1,4,7],[9,2,9,7],[10,2,10,7],[11,2,11,7],[12,2,12,7]]}
[]
[]
[]
[null,{"$f":"Resumen!B4","v":"PRESENTACIÓN DE PROYECTOS \nDE INICIACIÓN CIENTIFÍCA 2023 - 2"}]
[null,null,null,null,null,null,null,null,null,null,{"$f":"COUNTIF(C10:H81,\"<>\"&\"\")","v":0},"=> Numero de resgistros de descripción diligenciados."]
[null,null,null,null,null,null,null,null,null,null,{"$f":"SUM(K10:K81)","v":0},"=> Numero de caracteres diligenciados"]
[null,"7.","ESTRUCTURA DEL PROYECTO",null,null,null,null,null,null,null,"Tener en cuenta "]
[null,"a.","Descripción y Justificación del Proyecto ",null,null,null,null,null,null,null,"Tener en cuenta "]
{"$rows_left_out":18}
{"sheet":"Objetivos","index":4,"n_rows":28,"n_cols":11,"rows_kept":28,"cut":false,"hidden":false,"merged":[[27,2,27,7],[17,2,17,7],[18,2,18,7],[19,2,19,7],[20,2,20,7],[21,2,21,7],[22,2,22,7],[23,2,23,7],[15,2,15,7],[16,2,16,7],[24,2,24,7],[25,2,25,7],[26,2,26,7],[2,1,4,7],[8,2,8,7],[12,2,12,7],[13,2,13,7],[14,2,14,7]]}
[]
[]
[null,{"$f":"Resumen!B4","v":"PRESENTACIÓN DE PROYECTOS \nDE INICIACIÓN CIENTIFÍCA 2023 - 2"}]
[]
[]
[null,null,null,null,null,null,null,null,null,null,"Tener en cuenta "]
[null,"8.a","Información Objetivo -  General ",null,null,null,null,{"$f":"PD!J7","v":"PIC"},null,null,"Tener en cuenta "]
[null,null,null,null,null,null,null,null,null,null,"No debe tener mas de 999 caracteres o de largo"]
{"$rows_left_out":21}
{"sheet":"Metodología","index":5,"n_rows":22,"n_cols":11,"rows_kept":22,"cut":false,"hidden":false,"merged":[[20,2,20,7],[21,2,21,7],[3,1,4,7],[9,2,9,7],[10,2,10,7],[11,2,11,7],[12,2,12,7],[13,2,13,7],[14,2,14,7],[15,2,15,7],[16,2,16,7],[17,2,17,7],[18,2,18,7],[19,2,19,7]]}
[]
[]
[]
[null,{"$f":"Datos_Generales!B3","v":"PRESENTACIÓN DE PROYECTOS \nDE INICIACIÓN CIENTIFÍCA 2023 - 2"}]
[null,null,null,null,null,null,null,null,null,null,{"$f":"SUM(K10:K133)","v":0}]
[]
[null,"9.","ESTRUCTURA DEL PROYECTO",null,null,null,null,null,null,null,"Tener en cuenta "]
[null,"a.","Metodología propuesta para alcanzar cada uno de los objetivos específicos propuestos",null,null,null,null,null,null,null,"No debe tener mas de 999 caracteres por celda o de largo"]
{"$rows_left_out":15}
{"sheet":"Estado_del_Arte","index":6,"n_rows":25,"n_cols":11,"rows_kept":25,"cut":false,"hidden":false,"merged":[[13,1,13,7],[14,1,14,7],[22,1,22,7],[23,1,23,7],[24,1,24,7],[15,1,15,7],[16,1,16,7],[17,1,17,7],[18,1,18,7],[19,1,19,7],[20,1,20,7],[21,1,21,7],[3,1,4,7],[9,1,9,7],[10,1,10,7],[11,1,11,7],[12,1,12,7]]}
[]
[]
[]
[null,{"$f":"Datos_Generales!B3","v":"PRESENTACIÓN DE PROYECTOS \nDE INICIACIÓN CIENTIFÍCA 2023 - 2"}]
[null,null,null,null,null,null,null,null,null,null,{"$f":"SUM(K10:K313)","v":0}]
[]
[null,"10.","ESTRUCTURA DEL PROYECTO",null,null,null,null,null,null,null,"Tener en cuenta "]
[null,"b.","Estado del arte de la investigación, innovacion o emprendimiento",null,null,null,null,null,null,null,"No debe tener mas de 999 caracteres por celda o de largo"]
{"$rows_left_out":18}
{"sheet":"Marco_Teorico","index":7,"n_rows":25,"n_cols":11,"rows_kept":25,"cut":false,"hidden":true,"merged":[[13,1,13,7],[14,1,14,7],[22,1,22,7],[23,1,23,7],[24,1,24,7],[15,1,15,7],[16,1,16,7],[17,1,17,7],[18,1,18,7],[19,1,19,7],[20,1,20,7],[21,1,21,7],[3,1,4,5],[9,1,9,7],[10,1,10,7],[11,1,11,7],[12,1,12,7]]}
[]
[]
[]
[null,{"$f":"Datos_Generales!B3","v":"PRESENTACIÓN DE PROYECTOS \nDE INICIACIÓN CIENTIFÍCA 2023 - 2"},null,null,null,null,"Fecha de Emisión: 2014/07/31","IN-IV-F-14"]
[null,null,null,null,null,null,"Revision N°:\n1","Marco Teorico",null,null,{"$f":"SUM(K10:K313)","v":0}]
[]
[null,"9.","ESTRUCTURA DEL PROYECTO",null,null,null,null,null,null,null,"Tener en cuenta "]
[null,"c.","Marco Teorico",null,null,null,null,null,null,null,"No debe tener mas de 999 caracteres por celda o de largo"]
{"$rows_left_out":18}
{"sheet":"Cronograma","index":8,"n_rows":24,"n_cols":12,"rows_kept":24,"cut":false,"hidden":false,"merged":[[14,2,14,5],[15,2,15,5],[23,2,23,5],[24,2,24,7],[16,2,16,5],[17,2,17,5],[18,2,18,5],[19,2,19,5],[20,2,20,5],[21,2,21,5],[22,2,22,5],[3,1,4,7],[10,2,10,5],[11,2,11,5],[12,2,12,5],[13,2,13,5]]}
[]
[]
[]
[null,{"$f":"Datos_Generales!B3","v":"PRESENTACIÓN DE PROYECTOS \nDE INICIACIÓN CIENTIFÍCA 2023 - 2"},null,null,null,null,null,null,null,null,"Se pasan de Vigencia :",{"$f":"COUNTIF(L12:L24,\">\"&meses)","v":0}]
[]
[]
[null,"T","Tiempo total maximo de ejecucion por convocatoria (Meses): ",null,null,null,{"$f":"IFERROR(VLOOKUP(Elec_Conv,Conv_Opc,3,0),\"\")","v":5},null,null,null,"Tener en cuenta "]
[null,null,null,null,null,null,null,null,null,null,"No debe tener mas de 999 caracteres por celda o de largo"]
{"$rows_left_out":17}
{"sheet":"PD","index":9,"n_rows":49,"n_cols":26,"rows_kept":49,"cut":false,"hidden":true,"merged":[[27,8,27,9],[28,8,28,9],[29,8,29,9],[30,8,30,9],[17,8,17,9],[18,8,18,9],[19,8,19,9],[20,8,20,9],[21,8,21,9],[22,8,22,9],[23,8,23,9],[27,2,27,3],[28,2,28,3],[29,2,29,3],[16,2,16,3],[17,2,17,3],[18,2,18,3],[19,2,19,3],[20,2,20,3],[21,2,21,3],[22,2,22,3],[16,8,16,9],[23,2,23,3],[24,2,24,3],[25,2,25,3],[26,2,26,3],[24,8,24,9],[25,8,25,9],[26,8,26,9],[13,2,13,3],[13,8,13,9],[14,2,14,3],[14,8,14,9],[15,2,15,3],[15,8,15,9],[7,15,7,20],[8,8,8,9],[11,8,11,9],[12,8,12,9],[8,2,8,3],[9,2,9,3],[9,8,9,9],[10,2,10,3],[10,8,10,9],[11,2,11,3],[12,2,12,3],[3,1,4,5],[3,6,3,7],[3,8,3,9],[4,6,4,7],[4,8,4,9]]}
[]
[]
[]
[null,{"$f":"Datos_Generales!B3","v":"PRESENTACIÓN DE PROYECTOS \nDE INICIACIÓN CIENTIFÍCA 2023 - 2"},null,null,null,null,"Fecha de Emisión: 2014/07/31",null,"IN-IV-F-14"]
[null,null,null,null,null,null,"Revision N°:\n1",null,"Productividad",null,null,null,null,null,null,"INV","IMP","PIC","INO","PRO","EMP"]
[null,null,null,null,null,null,null,null,null,null,null,null,null,null,null,3,{"$f":"P6+1","v":4},5,6,7,8]
[null,"11.","Información de productividad comprometida del proyecto.",null,null,null,null,{"$f":"HLOOKUP(J7,P5:U7,2,0)","v":5},{"$f":"H31","v":0},{"$f":"IFERROR(Integrantes!I7,\"NA\")","v":"PIC"},null,{"$f":"SUM(K10:K30)","v":0}]
[null,null,null,null,null,null,null,{"$f":"Integrantes!S10","v":0},null,null,null,null,null,null,null,"Puntajes Asociados "]
{"$rows_left_out":42}
{"sheet":"Integrantes","index":10,"n_rows":32,"n_cols":15,"rows_kept":32,"cut":false,"hidden":false,"merged":[[31,1,31,8],[3,1,4,8],[8,3,8,4],[8,5,8,6],[9,1,11,1],[9,3,9,4],[9,5,9,6],[12,1,14,1],[17,4,17,8],[18,5,18,6],[19,7,19,8],[20,4,20,8],[15,1,17,1],[15,3,15,4],[16,3,16,4],[18,1,20,1],[18,3,18,4],[19,3,19,4],[13,3,13,4],[13,7,13,8],[14,4,14,8],[15,5,15,6],[16,7,16,8],[10,7,10,8],[11,4,11,8],[10,3,10,4],[12,3,12,4],[12,5,12,6]]}
[]
[]
[]
[null,{"$f":"Datos_Generales!B3","v":"PRESENTACIÓN DE PROYECTOS \nDE INICIACIÓN CIENTIFÍCA 2023 - 2"}]
[]
[]
[null,"15.","Imformacion de Integrantes del Proyecto",null,null,null,{"$f":"\"FunProy_\"&I7","v":"FunProy_PIC"},"FunProy_",{"$f":"IFERROR(VLOOKUP(Elec_Conv,Dt!$K$1:$L$7,2,0),\"NA\")","v":"PIC"}]
[null,null,null,null,null,null,null,5]
{"$rows_left_out":25}
{"sheet":"Presupuesto","index":11,"n_rows":100,"n_cols":19,"rows_kept":100,"cut":false,"hidden":false,"merged":[[96,1,96,3],[96,4,96,8],[97,7,98,8],[55,4,55,5],[56,4,56,5],[57,4,57,5],[58,4,58,5],[60,4,60,5],[61,4,61,5],[72,2,72,8],[59,4,59,5],[37,4,37,5],[38,4,38,5],[53,4,53,5],[54,4,54,5],[89,4,93,5],[73,3,73,8],[78,2,78,4],[32,4,32,5],[33,4,33,5],[34,4,34,5],[35,4,35,5],[36,4,36,5],[3,1,4,8],[27,2,27,8],[28,3,28,8],[30,4,30,5],[31,4,31,5]]}
[]
[]
[]
[null,{"$f":"Datos_Generales!B3","v":"PRESENTACIÓN DE PROYECTOS \nDE INICIACIÓN CIENTIFÍCA 2023 - 2"}]
[]
[]
[null,"12.","Anexo Para el calculo de presupuesto contrapartida por parte de personal investigativo.",null,null,null,null,{"$f":"Integrantes!I7","v":"PIC"},{"$f":"INT(PD!H31)","v":0}]
[]
{"$rows_left_out":93}
{"sheet":"Grupo","index":12,"n_rows":33,"n_cols":12,"rows_kept":33,"cut":false,"hidden":true,"merged":[[26,3,26,8],[29,3,29,8],[32,3,32,8],[3,2,4,6],[10,3,10,8],[11,4,11,8],[14,3,14,8],[17,3,17,8],[20,3,20,8],[23,3,23,8]]}
[]
[]
[]
[null,null,{"$f":"Datos_Generales!B3","v":"PRESENTACIÓN DE PROYECTOS \nDE INICIACIÓN CIENTIFÍCA 2023 - 2"},null,null,null,null,"Fecha de Emisión: 2014/07/31","IN-IV-F-14"]
[null,null,null,null,null,null,null,"Revision N°:\n1","Grupo de Investigación ",null,null,{"$f":"COUNTIF(L11:L35,0)","v":9}]
[null,null,null,null,null,null,null,null,null,null,null,"Tener en cuenta "]
[null,null,"18.","CONFORMACIÓN Y TRAYECTORIA DEL GRUPO DE INVESTIGACIÓN-",null,null,null,null,null,null,null,"No debe tener mas de 999 caracteres por celda o de largo"]
[null,null,null,"Se puede utilizar la convinación de teclas (Atl + Enter) para adicionar una nueva linea en las celdas o adicionar Filas "]
{"$rows_left_out":26}
{"sheet":"Impactos","index":13,"n_rows":24,"n_cols":12,"rows_kept":24,"cut":false,"hidden":false,"merged":[[21,4,21,8],[22,4,22,8],[8,4,8,8],[3,2,4,8],[18,4,18,8],[19,4,19,8],[20,4,20,8],[16,4,16,8],[17,4,17,8],[12,4,12,8],[13,4,13,8],[14,4,14,8],[15,4,15,8]]}
[]
[]
[]
[null,null,{"$f":"Datos_Generales!B3","v":"PRESENTACIÓN DE PROYECTOS \nDE INICIACIÓN CIENTIFÍCA 2023 - 2"}]
[null,null,null,null,null,null,null,null,null,null,null,{"$f":"SUM(L13:L131)","v":0}]
[null,null,null,null,null,null,null,null,null,null,null,{"$f":"COUNTIF(L14:L24,\"<>\"&0)","v":0}]
[null,null,"16.","ESTRUCTURA DEL PROYECTO",null,null,null,null,null,null,null,"Tener en cuenta "]
[null,null,"a.","Pertinencia a un Objetivo de Desarrollo Sostenible.",null,null,null,null,null,null,null,"No debe tener mas de 999 caracteres por celda o de largo"]
{"$rows_left_out":17}
{"sheet":"Biblografia","index":14,"n_rows":29,"n_cols":12,"rows_kept":29,"cut":false,"hidden":false,"merged":[[15,3,15,8],[16,3,16,8],[17,3,17,8],[18,3,18,8],[3,2,4,8],[14,3,14,8],[9,3,9,8],[10,3,10,8],[11,3,11,8],[12,3,12,8],[13,3,13,8],[19,3,19,8],[20,3,20,8],[21,3,21,8],[22,3,22,8],[23,3,23,8],[24,3,24,8],[25,3,25,8],[26,3,26,8],[27,3,27,8],[28,3,28,8]]}
[]
[]
[]
[null,null,{"$f":"Datos_Generales!B3","v":"PRESENTACIÓN DE PROYECTOS \nDE INICIACIÓN CIENTIFÍCA 2023 - 2"},null,null,null,null,null,null,null,null,{"$f":"COUNTIF(L10:L61,\">\"&0)","v":0}]
[null,null,null,null,null,null,null,null,null,null,null,{"$f":"SUM(L10:L74)","v":0}]
[null,null,null,null,null,null,null,null,null,null,null,"Tener en cuenta "]
[null,null,"16.","ESTRUCTURA DEL PROYECTO",null,null,null,null,null,null,null,"No debe tener mas de 999 caracteres por celda o de largo"]
[null,null,"c.","Bibliografia citada en la  estructura del proyecto",null,null,null,null,null,null,null,"Validación en número de caracteres"]
{"$rows_left_out":22}
{"sheet":"Imagenes","index":15,"n_rows":18,"n_cols":13,"rows_kept":18,"cut":false,"hidden":false,"merged":[[15,2,15,9],[16,2,16,9],[17,2,17,9],[18,2,18,9],[3,1,4,7],[9,2,9,9],[10,2,10,9],[11,2,11,9],[12,2,12,9],[13,2,13,9],[14,2,14,9]]}
[]
[]
[]
[null,{"$f":"Datos_Generales!B3","v":"PRESENTACIÓN DE PROYECTOS \nDE INICIACIÓN CIENTIFÍCA 2023 - 2"},null,null,null,null,null,null,"Fecha de Emisión: 2014/07/31","IN-IV-F-14"]
[null,null,null,null,null,null,null,null,"Revision N°:\n1","Apartes"]
[]
[null,"20.","Imágenes que contiene el proyecto"]
[null,"1.","Hoja destinada para elementos que estructuralmente se ingresan en los apartes de la propuesta de investigación."]
{"$rows_left_out":11}
{"sheet":"Normas","index":16,"n_rows":27,"n_cols":12,"rows_kept":27,"cut":false,"hidden":true,"merged":[[23,4,23,8],[24,3,24,8],[13,4,13,8],[14,4,14,8],[15,4,15,8],[16,4,16,8],[17,4,17,8],[18,4,18,8],[19,4,19,8],[11,4,11,8],[12,4,12,8],[20,4,20,8],[21,4,21,8],[22,4,22,8],[2,2,3,6],[7,4,7,8],[8,4,8,8],[9,4,9,8],[10,4,10,8]]}
[]
[]
[null,null,{"$f":"Datos_Generales!B3","v":"PRESENTACIÓN DE PROYECTOS \nDE INICIACIÓN CIENTIFÍCA 2023 - 2"},null,null,null,null,"Fecha de Emisión: 2014/07/31","IN-IV-F-14"]
[null,null,null,null,null,null,null,"Revision N°:\n1","Normas"]
[]
[null,null,"1.","Normas para el diligenciamiento de formulación de proyecto",null,null,null,null,"(No Imprimir esta hoja) ",null,null,"Tener en cuenta "]
[null,null,null,null,null,null,null,null,null,null,null,"No debe tener mas de 1024 caracteres o de largo"]
[null,null,"No","Tema","Descripción"]
{"$rows_left_out":19}