{"text_format":"1","workbook":"xlsx","n_sheets":13,"sheets":["Dt","General","Resumen","Estado_del_arte","Objetivos","Etica","Cronograma","Integrantes","Productos","Impactos","Presupuesto","Bibliografía","Declaración"],"not_rendered":{"charts":0,"images":1,"macros":1,"external_links":0,"defined_names":66,"comments":6,"pivot_tables":0},"unopened":[],"bounds":{"document_bytes":16777216,"sheet_cells":100000,"rows_first":2000,"rows_last":500,"rows_between":2000,"halvings":0,"cell_chars":16384,"cell_head_chars":4096},"cells_cut":0,"cells_raw":0,"read":"whole","date_system":"1900"}

{"sheet":"Dt","index":0,"n_rows":2005,"n_cols":648,"rows_kept":2005,"cut":false,"hidden":true,"merged":[]}
[null,"No eliminar Hoja … :)))",null,null,null,null,null,null,null,null,null,null,null,null,null,null,null,null,null,null,null,null,null,null,null,null,"No","Campo ","1_Opcion","2_Opcion",null,"Avaya1719",null,null,null,null,null,null,null,null,null,null,"http://scienti.colciencias.gov.co:8080/gruplac/jsp/visualiza/visualizagr.jsp?nro="]
[null,null,null,null,null,null,null,null,null,null,null,null,null,null,null,null,null,null,null,null,null,null,null,null,null,null,1,"Sedes","Calle 100",null,null,null,null,null,null,null,null,null,null,null,null,null,null,null,null,"BB",null,{"$f":"MIN(BD3:BD294)","v":4},{"$f":"MAX(BD3:BD294)","v":294}]
[null,null,null,null," ",null,null,null,null,null,null,null,null,null,null,null,null,null,null,null,null,null,null,null,null,null,2,"Sedes","Campus Cajicá",null,null,null,null,null,null,null,"Hoja",null,null,"Hoja","FAC","Grupo","COD","Clas","Link","Líneas","Fila Grupo","Min","Max","FAC",null,null,"COD","Línea","Cel","Fila","E:Gp",null,"Código de Grupo",null,null,null,null,"Hora","Agente","Agente",null,null,"Id","ID Final","Clase","Subclase","Producto","Descripción","Indicador",null,null,"Errores","No ERROR","Hoja","Descripción","Mensaje"," Validación","Item1","Item2","Item3",null,"Nhoja","Nombre","Error",null,"No","Tipo","Duración","Tipo","Alcance","Línea","SRL"]
[null,null,null,null,null,null,null,null,null,null,null,null,null,null,null,null,null,null,null,null,null,null,null,null,null,null,3,"Sedes","Medicina",null,null,null,null,null,null,null,3,1,{"$f":"COUNTIF($AN$4:$AN$811,AL4)","v":1},1,"CIAS","Fitoplasmas y Virus","COL0028687","B","https://scienti.minciencias.gov.co/gruplac/jsp/visualiza/visualizagr.jsp?nro=00000000008436",{"$f":"$AT$2&AV4&\":\"&$AT$2&AW4","v":"BB256:BB257"},{"$f":"ROW()","v":4},{"$f":"MINA(IF(AQ4=$BA$4:$BA$410,$BD$4:$BD$410))","v":256},{"$f":"MAXA(IF(AQ4=$BA$4:$BA$410,$BD$4:$BD$410))","v":257},"CIAS",null,null,"COL0178619","Modelos de simulación",{"$f":"COUNTIF(BA$4:BA4,BA4)","v":1},{"$f":"ROW()","v":4},{"$f":"COUNTIF($AQ$3:$AQ$87,BA4)","v":1},null,"COL0015722",{"$f":"COUNTIF($AQ$4:$AQ$79,BG4)","v":1},null,null,null,"19:54:00","a","a",{"$f":"DMIN(BL3:BM12,\"hora\",BN3:BN4)","v":0.4548611111111111},"|",1,201,"Productos resultado de actividades de desarrollo tecnológico e innovación (DTI)","Software","Software aprobado para registro ante la DNDA, de acuerdo con procedimientos establecidos por la UMNG."," ","Soporte lógico registre el aval para el software que incluya : Manual técnico,  Manual de usuario todos con la inclusión código  de trazabilidad, "," ",null,null,{"$f":"ROW()-4","v":0},null,null,null,null,null,null,null,null,{"$f":"CA5","v":1},{"$f":"IFERROR(Fx_Nhj(CJ4),\"-\")","v":"Dt"},{"$f":"MAX(IF($CB$3:$CB$19=$CK4,$CE$3:$CE$19,0))","v":0},null,1,"Fin de la pobreza","Corto (1 año)","Político","Regional","Transferencia e intercambio de conocimiento","SRL 0 – Identificación del problema."]
[null,null,null,null,null,null,null,null,null,null,null,null,null,null,null,null,null,null,null,null,null,null,null,null,null,null,4,"Sedes","Posgrados calle 94",null,null,null,null,null,null,null,4,2,1,2,"CIAS","Grupo de investigación en Biodiversidad y Ecología de Abejas Silvestres","COL0031959","B","https://scienti.minciencias.gov.co/gruplac/jsp/visualiza/visualizagr.jsp?nro=00000000001366",{"$f":"$AT$2&AV5&\":\"&$AT$2&AW5","v":"BB109:BB113"},{"$f":"ROW()","v":5},{"$f":"MINA(IF(AQ5=$BA$4:$BA$410,$BD$4:$BD$410))","v":109},{"$f":"MAXA(IF(AQ5=$BA$4:$BA$410,$BD$4:$BD$410))","v":113},"CIAS",null,null,"COL0178619","Bioinnovación y educación",{"$f":"COUNTIF(BA$4:BA5,BA5)","v":2},{"$f":"ROW()","v":5},1,null,"COL0026486",1,null,null,null,"09:54:00","b","B",null,null,2,202,"Productos resultado de actividades de desarrollo tecnológico e innovación (DTI)","Esquema trazado","Esquema de trazado de circuito integrado registrado ante la SIC a través de acto administrativo que resuelva la concesión favorable."," ","Documento en el que se describa el esquema de trazado de circuito integrado obtenido con nombre, autor, fecha, cód. de trazabilidad  y autores debidamente registrados según  Res. vigente, Acto administrativo de la Superintendencia de Industria y Comercio que resuelva la concesión favorable."," ",null,null,{"$f":"ROW()-4","v":1},"Presupuesto","Supera Rubro Equipos del 50 %",{"$f":"\"Supera Rubro [Equipos], Límite esta en \"&TEXT(CH5,\"$ #.##0\")& \", está superando por :\"&TEXT(Presupuesto!F116-CH5,\"$ #.##0\")","v":"Supera Rubro [Equipos], Límite esta en $ 62.500.000, está superando por :-$ 62.500.000"},{"$f":"IF(CF5>CG5,CA5,0)","v":0},{"$f":"Presupuesto!Q52","v":0},{"$f":"Presupuesto!O52","v":0.5},{"$f":"Presupuesto!R52","v":62500000},null,{"$f":"CA6","v":2},{"$f":"IFERROR(Fx_Nhj(CJ5),\"-\")","v":"General"},{"$f":"MAX(IF($CB$3:$CB$19=$CK5,$CE$3:$CE$19,0))","v":0},null,{"$f":"CN4+1","v":2},"Hambre Cero ","Medio (2 años)","Salud","Nacional","Gestión del conocimiento para la apropiación","SRL 1 – Identificación del problema y el grado de madurez social."]
[null,null,null,null,null,null,null,null,null,null,null,null,null,null,null,null,null,null,null,null,null,null,null,null,null,null,1,"Facultad","Ciencias Básicas","CIAS",null,null,null,null,null,null,12,3,1,3,"CIAS","MATRIX","COL0039321","B","https://scienti.minciencias.gov.co/gruplac/jsp/visualiza/visualizagr.jsp?nro=00000000002208","BB278:BB282",{"$f":"ROW()","v":6},{"$f":"MINA(IF(AQ6=$BA$4:$BA$410,$BD$4:$BD$410))","v":278},{"$f":"MAXA(IF(AQ6=$BA$4:$BA$410,$BD$4:$BD$410))","v":282},"CIAS",null,null,"COL0178619","Biología de poblaciones y evolutiva de plantas, animales y microorganismos",{"$f":"COUNTIF(BA$4:BA6,BA6)","v":3},{"$f":"ROW()","v":6},1,null,"COL0027367",1,null,null,null,"17:54:00","c","c",null,null,3,203,"Productos resultado de actividades de desarrollo tecnológico e innovación (DTI)","Normas Internacionales","Regulaciones, normas, reglamentos o legislaciones implementadas internacionalmente, acorde con parámetros de Minciencias. "," ","\"Documento en el que se describa la regulación, norma, reglamento o legislación+CR10 obtenido con nombre, autor, fecha, cód. de trazabilidad  y autores debidamente registrados según  Res. vigente\" ,\"Certificado de la entidad o institución que emitió el producto, indicando la participación en su construcción de todos o de alguno de los integrantes del proyecto, título, país, ciudad, fecha de  publicación / implementación, tipo de regulación, ámbito."," ",null,null,2,"Presupuesto","Supera monto máximo",{"$f":"\"No puede superar en presupuesto solicitado \"&TEXT(CG6,\"$ #.##0\")&\" Lo supera en \"&TEXT(CH6,\"$ #.##0\")","v":"No puede superar en presupuesto solicitado $ 125.000.000 Lo supera en $ 125.000.000"},0,{"$f":"Presupuesto!G103","v":0},{"$f":"Presupuesto!E157","v":125000000},{"$f":"ABS(CG6-CF6)","v":125000000},null,{"$f":"CA9","v":5},{"$f":"IFERROR(Fx_Nhj(CJ6),\"-\")","v":"Objetivos"},{"$f":"MAX(IF($CB$3:$CB$19=$CK6,$CE$3:$CE$19,0))","v":0},null,3,"Salud y bienestar","Largo (3 años)","Tecnológico","Internacional","Participación ciudadana en CTeI","SRL 2 – Formulación del problema, soluciones propuestas e impacto potencial, grado de madurez social esperado; identificación de partes interesadas relevantes para el proyecto"]
{"$rows_left_out":2000}
{"sheet":"General","index":1,"n_rows":62,"n_cols":24,"rows_kept":62,"cut":false,"hidden":false,"merged":[[59,1,59,8],[40,2,40,8],[44,2,44,8],[28,2,28,8],[30,3,30,8],[32,2,32,8],[34,3,34,8],[36,2,36,8],[41,2,41,6],[42,2,42,6],[43,2,43,6],[46,2,46,8],[47,2,47,6],[48,2,48,6],[11,2,11,5],[11,7,11,8],[12,2,12,8],[21,2,21,7],[50,2,50,8],[13,7,13,8],[13,2,13,5],[49,2,49,6],[26,3,26,8],[22,2,22,5],[22,7,22,8],[1,1,2,6],[8,1,8,8],[9,2,9,5],[9,7,9,8],[10,7,10,8],[10,2,10,5],[6,2,6,5],[6,7,6,8]]}
[1,null,null,null,null,null,null,{"$f":"IFERROR(VLOOKUP($C$7,Dt!AD130:AE133,2,0),\"INV\")","v":"INO"},{"$f":"IFERROR(VLOOKUP($C$23,Dt!$AC$6:$AD$13,2,0),\"NT\")","v":"CIAS"},null,null,null,null,7,"A",{"$f":"COUNTIF($I$28:$I$36,O1)","v":0},{"$f":"IF(P1>0,$N1,0)","v":0},null,null,null,null,null,null,"Número de Paginas del documento final , se puede ajustar."]
[null,"PRESENTACIÓN DE PROPUESTAS DE IDEAS \nINNOVADORAS 2025-1",null,null,null,null,null,"Fecha de Emisión: 2018/03/06","IN-IE-F-7",null,null,null,null,6,"A1",{"$f":"COUNTIF($I$28:$I$36,O2)","v":0},0,null,null,null,null,null,null,11]
[null,null,null,null,null,null,null,"Revisión N°:\n4",{"$f":"\"Página \"&A1&\" de \"&Dt_TPG","v":"Página 1 de 11"},null,null,null,null,5,"B",0,0,null,"Innovación"]
[null,null,null,null,null,null,null,null,null,null,null,null,null,null,null,0,0]
["1.-","Información general del proyecto.",null,null,null,null,null,null,"Vrs. 30-08b",null,null,null,null,4,"C",0,0,null,null,null,null,null,null,"Hoy es "]
[null,null,null,null,null,null,null,null,null,null,null,null,null,null,null,0,0]
{"$rows_left_out":57}
{"sheet":"Resumen","index":2,"n_rows":163,"n_cols":9,"rows_kept":163,"cut":false,"hidden":false,"merged":[[158,2,158,4],[159,2,159,4],[78,2,78,4],[80,2,80,4],[81,2,81,4],[82,2,82,4],[74,2,74,4],[75,2,75,4],[76,2,76,4],[155,2,155,4],[156,2,156,4],[117,2,117,4],[113,2,113,4],[119,2,119,4],[123,2,123,4],[125,2,125,4],[124,2,124,4],[130,2,130,4],[138,2,138,4],[112,2,112,4],[111,2,111,4],[118,2,118,4],[108,2,108,4],[110,2,110,4],[28,2,28,4],[30,2,30,4],[31,2,31,4],[32,2,32,4],[42,2,42,4],[43,2,43,4],[44,2,44,4],[38,2,38,4],[157,2,157,4],[150,2,150,4],[151,2,151,4],[147,2,147,4],[144,2,144,4],[145,2,145,4],[148,2,148,4],[149,2,149,4],[131,2,131,4],[132,2,132,4],[133,2,133,4],[134,2,134,4],[146,2,146,4],[139,2,139,4],[140,2,140,4],[109,2,109,4],[15,2,15,4],[16,2,16,4],[20,2,20,4],[22,2,22,4],[58,2,58,4],[102,2,102,4],[103,2,103,4],[67,2,67,4],[68,2,68,4],[84,2,84,4],[99,2,99,4],[73,2,73,4],[60,2,60,4],[62,2,62,4],[46,2,46,4],[33,2,33,4],[34,2,34,4],[36,2,36,4],[40,2,40,4],[41,2,41,4],[54,2,54,4],[56,2,56,4],[57,2,57,4],[26,2,26,4],[7,2,7,4],[1,2,2,2],[6,2,6,4],[10,2,10,4],[9,2,9,4],[89,2,89,4],[90,2,90,4],[91,2,91,4],[92,2,92,4],[8,2,8,4],[23,2,23,4],[24,2,24,4],[25,2,25,4],[59,2,59,4],[48,2,48,4],[49,2,49,4],[50,2,50,4],[51,2,51,4],[52,2,52,4],[17,2,17,4],[18,2,18,4],[4,2,4,4],[12,2,12,4],[14,2,14,4],[126,2,126,4],[83,2,83,4],[64,2,64,4],[65,2,65,4],[66,2,66,4],[100,2,100,4],[101,2,101,4],[70,2,70,4],[72,2,72,4],[93,2,93,4],[94,2,94,4]]}
[2,null,null,null,null,null,"*Pueden  Ocultar las Filas que no se utilicen."]
[null,null,{"$f":"General!B2","v":"PRESENTACIÓN DE PROPUESTAS DE IDEAS \nINNOVADORAS 2025-1"},{"$f":"General!$H$2","v":"Fecha de Emisión: 2018/03/06"},{"$f":"General!$I$2","v":"IN-IE-F-7"},null,{"$f":"SUM(G7:G11)","v":0},"<=== N° palabras en total"]
[null,null,null,{"$f":"General!$H$3","v":"Revisión N°:\n4"},{"$f":"\"Página \"&A1&\" de \"&Dt_TPG","v":"Página 2 de 11"},null,"Palabras","Largo L","Limite"]
[]
["4.-","#","Resumen de la propuesta ",null,null,null,{"$f":"SUM(G6:G12)","v":0},{"$f":"SUM(H6:H12)","v":0},30000]
[null,null,null,null,null,null,null,null,{"$f":"I5","v":30000}]
{"$rows_left_out":158}
{"sheet":"Estado_del_arte","index":3,"n_rows":41,"n_cols":8,"rows_kept":41,"cut":false,"hidden":false,"merged":[[36,2,36,4],[1,2,2,2],[31,2,31,4],[32,2,32,4],[33,2,33,4],[34,2,34,4],[19,2,19,4],[20,2,20,4],[21,2,21,4],[22,2,22,4],[23,2,23,4],[24,2,24,4],[13,2,13,4],[14,2,14,4],[15,2,15,4],[16,2,16,4],[17,2,17,4],[35,2,35,4],[25,2,25,4],[26,2,26,4],[27,2,27,4],[28,2,28,4],[29,2,29,4],[30,2,30,4],[18,2,18,4],[12,2,12,4],[7,2,7,4],[8,2,8,4],[9,2,9,4],[10,2,10,4],[11,2,11,4]]}
[3,null,null,null,null,null,"*Pueden  Ocultar las Filas que no se utilicen."]
[null,null,{"$f":"General!B2","v":"PRESENTACIÓN DE PROPUESTAS DE IDEAS \nINNOVADORAS 2025-1"},{"$f":"General!$H$2","v":"Fecha de Emisión: 2018/03/06"},{"$f":"General!$I$2","v":"IN-IE-F-7"}]
[null,null,null,{"$f":"General!$H$3","v":"Revisión N°:\n4"},{"$f":"\"Página \"&A1&\" de \"&Dt_TPG","v":"Página 3 de 11"},null,{"$f":"SUM(G8:G3501)","v":0},"<== Total de palabras"]
[]
["6.-","#","Estado del arte de la propuesta.",null,null,null,"Largo"]
["c.-","#","Antecedentes científicos y tecnológicos.",null,null,null,{"$f":"SUM(G7:G328)","v":0},"<=== Palabras en total"]
{"$rows_left_out":36}
{"sheet":"Objetivos","index":4,"n_rows":23,"n_cols":8,"rows_kept":23,"cut":false,"hidden":false,"merged":[[18,2,18,4],[17,2,17,4],[22,2,22,4],[21,2,21,4],[20,2,20,4],[19,2,19,4],[1,1,2,2],[7,2,7,4],[8,2,8,4],[9,2,9,4],[10,2,10,4],[6,1,6,4],[11,2,11,4],[13,2,13,4],[14,2,14,4],[15,2,15,4],[16,2,16,4],[12,2,12,4]]}
[4]
[null,{"$f":"General!B2","v":"PRESENTACIÓN DE PROPUESTAS DE IDEAS \nINNOVADORAS 2025-1"},null,{"$f":"General!$H$2","v":"Fecha de Emisión: 2018/03/06"},{"$f":"General!$I$2","v":"IN-IE-F-7"}]
[null,null,null,{"$f":"General!$H$3","v":"Revisión N°:\n4"},{"$f":"\"Página \"&A1&\" de \"&Dt_TPG","v":"Página 4 de 11"},null,{"$f":"SUM(G7:G3500)","v":0},"<== Total de palabras"]
[]
["7.-","Objetivos de la propuesta.",null,null,null,null,"Largo"]
[]
{"$rows_left_out":18}
{"sheet":"Etica","index":5,"n_rows":69,"n_cols":17,"rows_kept":69,"cut":false,"hidden":false,"merged":[[1,2,2,2],[6,2,6,3],[7,2,7,3]]}
[5,null,null,null,null,null,"*Pueden  Ocultar las Filas que no se utilicen."]
[null,null,{"$f":"Objetivos!B2","v":"PRESENTACIÓN DE PROPUESTAS DE IDEAS \nINNOVADORAS 2025-1"},"Fecha de Emisión: 2019/03/18","IN-IV-F-14",null,null,null,null,"Detalles:"]
[null,null,null,"Revisión N°:\n4",{"$f":"\"Página \"&A1&\" de \"&Dt_TPG","v":"Página 5 de 11"},null,{"$f":"SUM(G5:G3524)","v":429},"<== Total de palabras"]
[]
[null,null,{"$f":"$Q$13","v":"."}]
["8b.-",0,"Consideraciones e implicaciones éticas de la investigación, bioética e integridad científica",null,"( Si  / No  )",null,"Palabras",null,null,null,null,null,"Validaciones"]
{"$rows_left_out":64}
{"sheet":"Cronograma","index":6,"n_rows":33,"n_cols":12,"rows_kept":33,"cut":false,"hidden":false,"merged":[[1,1,2,2]]}
[6,null,null,null,null,null,null,null,"*Pueden  Ocultar las Filas que no se utilicen.",null,null,{"$f":"(\"* Actualmente tiene \"&G7&\" meses de ejecución no superar los \"& G5&\" meses.\")","v":"* Actualmente tiene 0 meses de ejecución no superar los 12 meses."}]
[null,{"$f":"General!B2","v":"PRESENTACIÓN DE PROPUESTAS DE IDEAS \nINNOVADORAS 2025-1"},null,{"$f":"General!$H$2","v":"Fecha de Emisión: 2018/03/06"},{"$f":"General!$I$2","v":"IN-IE-F-7"}]
[null,null,null,{"$f":"General!$H$3","v":"Revisión N°:\n4"},{"$f":"\"Página \"&A1&\" de \"&Dt_TPG","v":"Página 6 de 11"}]
[]
["9.-","Cronograma de actividades a desarrollar",null,null,{"$f":"Integrantes!J6","v":12},null,{"$f":"E5","v":12},"Meses Máximo","Palabras"]
[]
{"$rows_left_out":28}
{"sheet":"Integrantes","index":7,"n_rows":42,"n_cols":29,"rows_kept":42,"cut":false,"hidden":false,"merged":[[37,6,37,7],[10,6,10,7],[25,25,25,26],[35,1,37,1],[20,1,22,1],[23,1,25,1],[26,1,28,1],[29,1,31,1],[32,1,34,1],[21,5,21,7],[24,5,24,7],[33,5,33,7],[36,5,36,7],[27,5,27,7],[11,1,13,1],[14,1,16,1],[17,1,19,1],[13,6,13,7],[16,6,16,7],[19,6,19,7],[2,1,3,4],[2,6,2,7],[3,6,3,7],[8,1,10,1],[9,5,9,7],[31,6,31,7],[34,6,34,7],[30,5,30,7],[18,5,18,7],[12,5,12,7],[15,5,15,7],[22,6,22,7],[25,6,25,7],[28,6,28,7]]}
[8]
[]
[null,{"$f":"General!B2","v":"PRESENTACIÓN DE PROPUESTAS DE IDEAS \nINNOVADORAS 2025-1"},null,null,null,{"$f":"General!$H$2","v":"Fecha de Emisión: 2018/03/06"},"IN-IV-F-14"]
[null,null,null,null,null,{"$f":"General!$H$3","v":"Revisión N°:\n4"},{"$f":"\"Página \"&A1&\" de \"&Dt_TPG","v":"Página 8 de 11"},{"$f":"\"Página \"&A2&\" de \"&Dt_TPG","v":"Página  de 11"},null,20]
[null,null,null,null,null,null,null,null,null,null,{"$f":"W5","v":0},null,null,null,null,null,null,null,null,null,null,null,{"$f":"IFERROR(VLOOKUP($Y$5,Dt_MsgERR,4,0),\".\")","v":0},"Integrantes",{"$f":"VLOOKUP($X$5,Dt_IndERR,2,0)","v":0}]
["11.-","Investigadores Integrantes del proyecto.",null,null,null,{"$f":"Cel_TP","v":"INO"},{"$f":"Cel_Fac","v":"CIAS"},{"$f":"V_Max","v":0},null,{"$f":"IF(F6=\"INO\",12,6)","v":12},null,null,null,null,null,null,null,null,null,null,null,null,"* Cuadro para tener relación entre Función y Tipo de Vinculo"]
{"$rows_left_out":37}
{"sheet":"Productos","index":8,"n_rows":55,"n_cols":17,"rows_kept":55,"cut":false,"hidden":false,"merged":[[1,1,2,3],[39,2,39,5],[31,2,31,4],[32,2,32,4],[33,2,33,4],[34,2,34,4],[25,2,25,4],[26,2,26,4],[27,2,27,4],[28,2,28,4],[29,2,29,4],[30,2,30,4],[17,4,17,5],[18,4,18,5],[19,4,19,5],[20,4,20,5],[5,4,5,5],[12,4,12,5],[13,4,13,5],[14,4,14,5],[15,4,15,5],[6,4,6,5],[16,4,16,5],[7,4,7,5],[8,4,8,5],[9,4,9,5],[10,4,10,5],[11,4,11,5]]}
[7]
[null,{"$f":"General!B2","v":"PRESENTACIÓN DE PROPUESTAS DE IDEAS \nINNOVADORAS 2025-1"},null,null,{"$f":"General!$H$2","v":"Fecha de Emisión: 2018/03/06"},{"$f":"General!$I$2","v":"IN-IE-F-7"}]
[null,null,null,null,{"$f":"General!$H$3","v":"Revisión N°:\n4"},{"$f":"\"Página \"&A1&\" de \"&Dt_TPG","v":"Página 7 de 11"},null,null,"N","Ok","Abreviatura","Indicadores","Descripcion","Descripcion","Ok"]
[null,null,null,null,{"$f":"IF(F5=\"INV\",3,4)","v":4},null,null,null,{"$f":"ROW()-3","v":1},{"$f":"ABS(LEFT(K4,3))","v":201},{"$f":"VLOOKUP($I4,Dt_prod2,2,0)&\"- \"&VLOOKUP($I4,Dt_prod2,5,0)","v":"201- Software aprobado para registro ante la DNDA, de acuerdo con procedimientos establecidos por la UMNG."},{"$f":"CLEAN(TRIM(VLOOKUP($I4,Dt_prod2,7,0)))","v":"Soporte lógico registre el aval para el software que incluya : Manual técnico, Manual de usuario todos con la inclusión código de trazabilidad,"},0,null,{"$f":"COUNTIF($G$7:$G$21,$J4)","v":0}]
[null,"Productividad comprometida",null,null,{"$f":"K25","v":"Modalidad 4"},{"$f":"General!$H$1","v":"INO"},null,null,{"$f":"ROW()-3","v":2},{"$f":"ABS(LEFT(K5,3))","v":202},"202- Esquema de trazado de circuito integrado registrado ante la SIC a través de acto administrativo que resuelva la concesión favorable.","Documento en el que se describa el esquema de trazado de circuito integrado obtenido con nombre, autor, fecha, cód. de trazabilidad y autores debidamente registrados según Res. vigente, Acto administrativo de la Superintendencia de Industria y Comercio que resuelva la concesión favorable.",0,null,{"$f":"COUNTIF($G$7:$G$21,$J5)","v":0}]
[null,"N°","Resultado/Producto esperado","Descripción o detalles del producto esperado","Indicador",null,null,null,3,203,"203- Regulaciones, normas, reglamentos o legislaciones implementadas internacionalmente, acorde con parámetros de Minciencias. ","\"Documento en el que se describa la regulación, norma, reglamento o legislación+CR10 obtenido con nombre, autor, fecha, cód. de trazabilidad y autores debidamente registrados según Res. vigente\" ,\"Certificado de la entidad o institución que emitió el producto, indicando la participación en su construcción de todos o de alguno de los integrantes del proyecto, título, país, ciudad, fecha de publicación / implementación, tipo de regulación, ámbito.",0,null,0]
{"$rows_left_out":50}
{"sheet":"Impactos","index":9,"n_rows":45,"n_cols":15,"rows_kept":45,"cut":false,"hidden":false,"merged":[[18,2,18,6],[1,2,2,4],[7,5,7,6],[8,5,8,6],[9,2,9,6],[11,2,11,6],[12,2,12,3],[12,4,12,6],[13,2,13,3],[13,4,13,6],[15,2,15,6],[16,2,16,6],[17,2,17,6],[31,4,31,6],[32,4,32,6],[19,2,19,6],[20,2,20,6],[21,2,21,6],[23,2,23,6],[29,4,29,6],[30,4,30,6]]}
[10,null,null,null,null,null,null,null,"*Pueden  Ocultar las Filas que no se utilicen."]
[null,null,{"$f":"Objetivos!B2","v":"PRESENTACIÓN DE PROPUESTAS DE IDEAS \nINNOVADORAS 2025-1"},null,null,"Fecha de Emisión: 2019/03/18","IN-IV-F-14",null,null,"Palabras Mínimas"]
[null,null,null,null,null,"Revisión N°:\n4",{"$f":"\"Página \"&$A$1&\" de \"&Dt_TPG","v":"Página 10 de 11"},null,{"$f":"SUM(I7:I3517)","v":55},"<== Total de palabras",null,null,"Tipo de Impacto (Objetivos de Desarrollo Sostenible): Link Presione",null,{"$f":"COUNTIF(N17:N25,0)","v":9}]
[]
["14.-","#","Impactos asociados a la propuesta.",null,null,null,null,null,"Largo"]
[null,null,null,null,null,null,null,null,null,null,null,null,"Explicaciones"]
{"$rows_left_out":40}
{"sheet":"Presupuesto","index":10,"n_rows":169,"n_cols":31,"rows_kept":169,"cut":false,"hidden":false,"merged":[[131,1,133,1],[2,1,3,6],[6,3,6,8],[7,3,7,5],[7,7,7,8],[110,1,112,1],[113,1,115,1],[116,1,118,1],[119,1,121,1],[122,1,124,1],[125,1,127,1],[128,1,130,1],[160,3,161,3],[160,4,161,8],[134,1,136,1],[137,1,139,1],[140,1,142,1],[143,1,145,1],[146,1,148,1],[158,4,158,8]]}
[9,null,null,null,null,null,null,null,null,null,null,null,null,null,null,null,null,null,"Tabla de Topes",null,null,"Validación",{"$f":"IF(P2=\"INV\",2,3)","v":3},null,"Productividad Vs Presupuesto",null,null,null,"Modalidad"]
[null,null,null,null,null,null,null,null,null,null,null,null,"1.-> Limite presupuestal",{"$f":"IF(MIN(N6:P6)<1, 20000000,MIN(N6:P6))","v":125000000},null,{"$f":"H10","v":"INO"},null,"Clasif","INV","IMP",null,"A",{"$f":"IFERROR(VLOOKUP($V2,$R$2:$T$9,W$1,0),0)","v":0},null,{"$f":"INT(W8/10)*10","v":0},"Pts","$$$$",null,"Mod","Monto","Acompa"]
[null,{"$f":"Productos!B2","v":"PRESENTACIÓN DE PROPUESTAS DE IDEAS \nINNOVADORAS 2025-1"},null,null,null,null,null,"Fecha de Emisión: 2019/03/18","IN-IV-F-14",null,null,null,null,"Limite Grupo","Modalidad","Limite Convo",null,"A",{"$f":"AA7","v":80},0,null,"",{"$f":"IFERROR(VLOOKUP($V3,$R$2:$T$9,W$1,0),0)","v":0},null,{"$f":"IF($Y$2>Z3,0,1)","v":1},20,20,null,1,50,25]
[null,null,null,null,null,null,null,"Revisión N°:\n4",{"$f":"\"Página \"&$A$1&\" de \"&Dt_TPG","v":"Página 9 de 11"},null,null,null,"Mayor Grupo",{"$f":"MAX($W$2:$W$5)","v":0},{"$f":"IFERROR(ABS(RIGHT(LEFT(General!C13,11))),0)","v":4},{"$f":"IF(H10=\"INO\",MAX(AD2:AD10),$AA$8)","v":125},null,"A1",{"$f":"AA7","v":80},0,null,"",{"$f":"IFERROR(VLOOKUP($V4,$R$2:$T$9,W$1,0),0)","v":0},null,{"$f":"IF($Y$2>Z4,0,1)","v":1},40,50,null,2,{"$f":"AD3","v":50},25]
[null,null,null,null,null,null,null,null,null,null,null,null,null,null,null,null,null,"B",{"$f":"AA6","v":60},0,null,null,0,null,1,50,50,null,3,70,25]
[null,null,null,null,null,null,null,null,null,null,null,null,1000000,{"$f":"O6","v":125000000},{"$f":"VLOOKUP($O$4,$AC$3:$AE$6,2,0)*M6","v":125000000},{"$f":"P4*M6","v":125000000},null,"C",{"$f":"AA5","v":50},0,null,null,null,null,1,60,60,null,4,125,25]
{"$rows_left_out":164}
{"sheet":"Bibliografía","index":11,"n_rows":39,"n_cols":8,"rows_kept":39,"cut":false,"hidden":false,"merged":[[34,2,34,4],[23,2,23,4],[24,2,24,4],[25,2,25,4],[26,2,26,4],[27,2,27,4],[28,2,28,4],[29,2,29,4],[30,2,30,4],[31,2,31,4],[32,2,32,4],[33,2,33,4],[22,2,22,4],[11,2,11,4],[12,2,12,4],[13,2,13,4],[14,2,14,4],[15,2,15,4],[16,2,16,4],[17,2,17,4],[18,2,18,4],[19,2,19,4],[20,2,20,4],[21,2,21,4],[10,2,10,4],[1,2,2,2],[6,2,6,4],[7,2,7,4],[8,2,8,4],[9,2,9,4]]}
[11,null,null,null,null,null,"*Pueden  Ocultar las Filas que no se utilicen."]
[null,null,{"$f":"General!B2","v":"PRESENTACIÓN DE PROPUESTAS DE IDEAS \nINNOVADORAS 2025-1"},{"$f":"General!$H$2","v":"Fecha de Emisión: 2018/03/06"},{"$f":"General!$I$2","v":"IN-IE-F-7"}]
[null,null,null,{"$f":"General!$H$3","v":"Revisión N°:\n4"},{"$f":"\"Página \"&$A$1&\" de \"&Dt_TPG","v":"Página 11 de 11"},null,{"$f":"SUM(G7:G3500)","v":0},"<== Total de palabras"]
[]
["15.-","#","Bibliografía de la propuesta.",null,null,null,"Largo"]
[]
{"$rows_left_out":34}
{"sheet":"Declaración","index":12,"n_rows":49,"n_cols":8,"rows_kept":49,"cut":false,"hidden":false,"merged":[[1,2,2,2],[6,2,6,4],[7,2,7,4],[9,2,9,4],[10,2,10,4],[12,2,12,4],[13,2,13,4],[14,2,14,4],[15,2,15,4],[11,2,11,4]]}
[13,null,null,null,null,null,"*Pueden  Ocultar las Filas que no se utilicen."]
[null,null,{"$f":"Bibliografía!C2","v":"PRESENTACIÓN DE PROPUESTAS DE IDEAS \nINNOVADORAS 2025-1"},"Fecha de Emisión: 2019/03/18","IN-IV-F-14"]
[null,null,null,"Revisión N°:\n4",{"$f":"\"Página \"&$A$1&\" de \"&Dt_TPG","v":"Página 13 de 11"},null,{"$f":"SUM(G10:G3510)","v":0},"<== Total de palabras"]
[]
["15.-","#","Declaración la propuesta.",null,null,null,"Largo"]
[]
{"$rows_left_out":43}