{"text_format":"1","workbook":"xlsx","n_sheets":13,"sheets":["Dt","General","Resumen","Estado_del_arte","Objetivos","Etica","Metodología","Cronograma","Productos","Integrantes","Presupuesto","Impactos","Bibliografía"],"not_rendered":{"charts":0,"images":1,"macros":1,"external_links":0,"defined_names":56,"comments":7,"pivot_tables":0},"unopened":[],"bounds":{"document_bytes":16777216,"sheet_cells":100000,"rows_first":2000,"rows_last":500,"rows_between":2000,"halvings":0,"cell_chars":16384,"cell_head_chars":4096},"cells_cut":0,"cells_raw":0,"read":"whole","date_system":"1900"}

{"sheet":"Dt","index":0,"n_rows":2006,"n_cols":644,"rows_kept":2006,"cut":false,"hidden":true,"merged":[]}
[null,"No eliminar Hoja … :)))",null,null,null,null,null,"Cronograma",null,null,"Integrante",null,null,null,null,null,null,null,null,null,null,null,null,null,null,null,"No","Campo ","1_Opcion","2_Opcion",null,"Avaya1719",null,null,null,null,null,null,null,null,null,"2018-03-16","http://scienti.colciencias.gov.co:8080/gruplac/jsp/visualiza/visualizagr.jsp?nro="]
[null,null,null,null,null,"Tipo","Objetivo","Actividad","Mes Inicio","Duracion","CC","Nombre","Apellidos","Nivel","Mes","Horas","Rol","Vin","NBC","Cvlac","Nombre Completo",null,null,null,null,null,1,"Sedes","Bogotá",null,null,null,null,null,null,null,null,null,null,null,null,null,null,null,null,"BB",null,{"$f":"MIN(BD3:BD293)","v":4},{"$f":"MAX(BD3:BD293)","v":293}]
[null,null,"Dato",null," ",{"$f":"ROW()-3","v":0},{"$f":"CLEAN(TRIM(Objetivos!C8))","v":""},"NA","NA","NA","NA","NA","NA","NA","NA","NA","NA","NA","NA","NA","NA",null,null,null,null,null,2,"Sedes","Campus Nueva Granada",null,null,null,null,null,null,null,"Hoja",null,null,"Hoja","FAC","Grupo","COD","Clas","Link","Lineas","Fila Grupo","Min","Max","FAC",null,null,"COD","Linea","Cel","Fila","E:Gp",null,null,"Hora","Agente","Agente"]
[null,null,"Titulo",{"$f":"TRIM(CLEAN(General!B9))","v":"Formato: actualizado a 06 Nov 2019"},null,{"$f":"ROW()-3","v":1},{"$f":"CLEAN(TRIM(Objetivos!C9))","v":""},{"$f":"CLEAN(TRIM(Cronograma!C8))","v":""},{"$f":"Cronograma!D8","v":0},{"$f":"Cronograma!E8","v":0},{"$f":"INDEX(Dt_Integ,2+($F4-1)*3,(COLUMN()-9))","v":0},"a",0,0,24,0,{"$f":"INDEX(Dt_Integ,3+($F4-1)*3,(COLUMN()-14))","v":"Investigador Principal"},{"$f":"INDEX(Dt_Integ,3+($F4-1)*3,(COLUMN()-14))","v":"Doc. Carrera TC"},{"$f":"INDEX(Dt_Integ,3+($F4-1)*3,(COLUMN()-14))","v":0},{"$f":"INDEX(Dt_Integ,4+($F4-1)*3,(COLUMN()-17))","v":0},{"$f":"(TRIM(L4&\" \"&M4))","v":"a 0"},null,null,null,null,null,3,"Sedes","Medicina","No habilitada 2018",null,null,null,null,null,null,3,1,{"$f":"COUNTIF($AN$4:$AN$806,AL4)","v":1},1,"CIAS","Fitoplasmas y Virus","COL0028687","C","http://scienti.colciencias.gov.co:8085/gruplac/jsp/visualiza/visualizagr.jsp?nro=00000000008436",{"$f":"$AT$2&AV4&\":\"&$AT$2&AW4","v":"BB10:BB11"},{"$f":"ROW()","v":4},{"$f":"MINA(IF(AQ4=$BA$4:$BA$401,$BD$4:$BD$401))","v":10},{"$f":"MAXA(IF(AQ4=$BA$4:$BA$401,$BD$4:$BD$401))","v":11},{"$f":"AO4","v":"CIAS"},null,null,"COL0049659","Medios de comunicación, educación y salud",{"$f":"COUNTIF(BA$4:BA4,BA4)","v":1},{"$f":"ROW()","v":4},{"$f":"COUNTIF($AQ$3:$AQ$80,BA4)","v":1},null,null,"19:54:00","a","a",{"$f":"DMIN(BH3:BI12,\"hora\",BJ3:BJ4)","v":0.4548611111111111},"|"]
[null,null,"Lider",{"$f":"TRIM(CLEAN(General!C10))","v":""},null,{"$f":"ROW()-3","v":2},{"$f":"CLEAN(TRIM(Objetivos!C10))","v":""},{"$f":"CLEAN(TRIM(Cronograma!C9))","v":""},{"$f":"Cronograma!D9","v":0},{"$f":"Cronograma!E9","v":0},0,0,0,0,10,0,{"$f":"INDEX(Dt_Integ,3+($F5-1)*3,(COLUMN()-14))","v":"Auxiliar de Investigación."},"Estímulo a estudiante",null,0,{"$f":"TRIM(L5&\" \"&M5)","v":"0 0"},null,null,null,null,null,4,"Sedes","Otros","No habilitada 2018",null,null,null,null,null,null,4,2,1,{"$f":"AN4+1","v":2},"CIAS","Grupo de investigación en Biodiversidad y ecología de abejas silvestres","COL0031959","B","http://scienti.colciencias.gov.co:8085/gruplac/jsp/visualiza/visualizagr.jsp?nro=00000000001366",{"$f":"$AT$2&AV5&\":\"&$AT$2&AW5","v":"BB12:BB16"},{"$f":"ROW()","v":5},{"$f":"MINA(IF(AQ5=$BA$4:$BA$401,$BD$4:$BD$401))","v":12},{"$f":"MAXA(IF(AQ5=$BA$4:$BA$401,$BD$4:$BD$401))","v":16},{"$f":"AO5","v":"CIAS"},null,null,"COL0049659","Salud Pública y Nutrición, Prevención de la Enfermedad y Promoción de la Salud",{"$f":"COUNTIF(BA$4:BA5,BA5)","v":2},{"$f":"ROW()","v":5},1,null,null,"09:54:00","b","B"]
[null,null,"Sede",{"$f":"General!H12","v":0},null,3,{"$f":"CLEAN(TRIM(Objetivos!C11))","v":""},{"$f":"CLEAN(TRIM(Cronograma!C10))","v":""},{"$f":"Cronograma!D10","v":0},{"$f":"Cronograma!E10","v":0},0,0,0,0,10,0,0,0,null,0,"0 0",null,null,null,null,null,1,"Facultad","Ciencias Básicas y Aplicadas","CIAS",null,null,null,null,null,null,12,3,1,{"$f":"AN5+1","v":3},"CIAS","MATRIX","COL0039321","C","http://scienti.colciencias.gov.co:8085/gruplac/jsp/visualiza/visualizagr.jsp?nro=00000000002208","BB38:BB42",{"$f":"ROW()","v":6},{"$f":"MINA(IF(AQ6=$BA$4:$BA$401,$BD$4:$BD$401))","v":38},{"$f":"MAXA(IF(AQ6=$BA$4:$BA$401,$BD$4:$BD$401))","v":42},"CIAS",null,null,"COL0062704","Procesos Organizacionales (Prospectiva de las Organizaciones), Programáticos y Políticos para la Promoción del Desarrollo.",{"$f":"COUNTIF(BA$4:BA6,BA6)","v":1},{"$f":"ROW()","v":6},1,null,null,"17:54:00","c","c"]
{"$rows_left_out":2001}
{"sheet":"General","index":1,"n_rows":136,"n_cols":24,"rows_kept":136,"cut":false,"hidden":false,"merged":[[40,2,40,8],[30,2,30,8],[31,2,31,6],[33,7,33,8],[39,7,39,8],[37,2,37,6],[38,2,38,6],[26,2,26,8],[32,2,32,6],[34,2,34,8],[36,2,36,8],[24,2,24,8],[55,1,55,8],[42,2,42,8],[46,2,46,8],[43,2,43,6],[44,2,44,6],[45,7,45,8],[18,2,18,8],[22,2,22,8],[1,1,2,6],[12,2,12,5],[12,7,12,8],[8,1,8,8],[9,2,9,5],[9,7,9,8],[6,2,6,5],[6,7,6,8],[10,2,10,5],[10,7,10,8],[16,2,16,8],[20,2,20,8]]}
[1,null,null,null,null,null,null,{"$f":"IFERROR(VLOOKUP($C$7,Dt!AD81:AE82,2,0),\"POS\")","v":"POS"},{"$f":"IFERROR(VLOOKUP($C$13,Dt!$AC$6:$AD$13,2,0),\"NT\")","v":"NT"},null,null,null,null,null,null,null,null,null,null,null,null,null,null,"Número de Paginas del documento final , se puede ajustar."]
[null,"PRESENTACIÓN DE PROYECTOS \nEN INVESTIGACIÓN DE POSGRADOS",null,null,null,null,null,"Fecha de Emisión: 2018/03/07","IN-IV-F-14",null,null,null,null,null,null,null,null,null,{"$f":"S3","v":"."},null,null,null,null,11]
[null,null,null,null,null,null,null,"Revision N°:\n3",{"$f":"\"Página \"&A1&\" de \"&Dt_TPG","v":"Página 1 de 11"},null,null,null,null,null,null,null,null,null,"."]
[]
["1.-","Información general del proyecto.",null,null,null,null,null,null,{"$f":"\"Vrs.- \"&TEXT(DAY($U$5),\"00\")&\".\"&(TEXT(MONTH($U$5),\"00\"))&U7","v":"Vrs.- 24.10"},null,null,null,null,null,null,null,null,null,"Fecha Actualización ",null,{"$f":"I60","v":"2019-10-24"},null,null,"Hoy es "]
[]
{"$rows_left_out":131}
{"sheet":"Resumen","index":2,"n_rows":55,"n_cols":13,"rows_kept":55,"cut":false,"hidden":false,"merged":[[44,2,44,4],[41,3,41,4],[39,2,39,4],[42,3,42,4],[25,2,25,4],[26,2,26,4],[27,2,27,4],[28,2,28,4],[20,2,20,4],[21,2,21,4],[22,2,22,4],[23,2,23,4],[24,2,24,4],[8,2,8,4],[7,2,7,4],[1,2,2,2],[6,2,6,4],[19,2,19,4],[13,2,13,4],[12,2,12,4],[11,2,11,4],[10,2,10,4],[9,2,9,4]]}
[2,null,null,null,null,null,"*Pueden  Ocultar las Filas que no se utilicen."]
[null,null,{"$f":"General!B2","v":"PRESENTACIÓN DE PROYECTOS \nEN INVESTIGACIÓN DE POSGRADOS"},{"$f":"General!$H$2","v":"Fecha de Emisión: 2018/03/07"},{"$f":"General!$I$2","v":"IN-IV-F-14"},null,{"$f":"SUM(G7:G14)","v":0},"<=== N° palabras en total"]
[null,null,null,{"$f":"General!$H$3","v":"Revision N°:\n3"},{"$f":"\"Página \"&A1&\" de \"&Dt_TPG","v":"Página 2 de 11"},null,"Palabras","Largo L"]
[]
["4.-","#","Resumen de la propuesta .",null,null,null,{"$f":"SUM(G6:G15)","v":0},{"$f":"SUM(H6:H15)","v":0}]
[]
{"$rows_left_out":50}
{"sheet":"Estado_del_arte","index":3,"n_rows":40,"n_cols":8,"rows_kept":40,"cut":false,"hidden":false,"merged":[[35,2,35,4],[1,2,2,2],[30,2,30,4],[31,2,31,4],[32,2,32,4],[33,2,33,4],[18,2,18,4],[19,2,19,4],[20,2,20,4],[21,2,21,4],[22,2,22,4],[23,2,23,4],[12,2,12,4],[13,2,13,4],[14,2,14,4],[15,2,15,4],[16,2,16,4],[34,2,34,4],[24,2,24,4],[25,2,25,4],[26,2,26,4],[27,2,27,4],[28,2,28,4],[29,2,29,4],[17,2,17,4],[11,2,11,4],[6,2,6,4],[7,2,7,4],[8,2,8,4],[9,2,9,4],[10,2,10,4]]}
[3,null,null,null,null,null,"*Pueden  Ocultar las Filas que no se utilicen."]
[null,null,{"$f":"General!B2","v":"PRESENTACIÓN DE PROYECTOS \nEN INVESTIGACIÓN DE POSGRADOS"},{"$f":"General!$H$2","v":"Fecha de Emisión: 2018/03/07"},{"$f":"General!$I$2","v":"IN-IV-F-14"}]
[null,null,null,{"$f":"General!$H$3","v":"Revision N°:\n3"},{"$f":"\"Página \"&A1&\" de \"&Dt_TPG","v":"Página 3 de 11"},null,{"$f":"SUM(G7:G3500)","v":0},"<== Total de palabras"]
[]
["6.-","#","Estado del arte de la propuesta o  antecedesntes.",null,null,null,"Largo"]
[]
{"$rows_left_out":35}
{"sheet":"Objetivos","index":4,"n_rows":31,"n_cols":8,"rows_kept":31,"cut":false,"hidden":false,"merged":[[18,2,18,4],[17,2,17,4],[22,2,22,4],[21,2,21,4],[20,2,20,4],[19,2,19,4],[1,1,2,2],[7,2,7,4],[8,2,8,4],[9,2,9,4],[10,2,10,4],[6,1,6,4],[11,2,11,4],[13,2,13,4],[14,2,14,4],[15,2,15,4],[16,2,16,4],[12,2,12,4]]}
[4]
[null,{"$f":"General!B2","v":"PRESENTACIÓN DE PROYECTOS \nEN INVESTIGACIÓN DE POSGRADOS"},null,{"$f":"General!$H$2","v":"Fecha de Emisión: 2018/03/07"},{"$f":"General!$I$2","v":"IN-IV-F-14"}]
[null,null,null,{"$f":"General!$H$3","v":"Revision N°:\n3"},{"$f":"\"Página \"&A1&\" de \"&Dt_TPG","v":"Página 4 de 11"},null,{"$f":"SUM(G7:G3500)","v":0},"<== Total de palabras"]
[]
["7.-","Objetivos de la propuesta.",null,null,null,null,"Largo"]
[]
{"$rows_left_out":26}
{"sheet":"Etica","index":5,"n_rows":71,"n_cols":17,"rows_kept":71,"cut":false,"hidden":false,"merged":[[62,2,62,4],[64,2,64,3],[65,2,65,4],[67,2,67,4],[56,2,56,4],[57,2,57,3],[58,2,58,4],[59,2,59,3],[60,2,60,4],[61,2,61,3],[55,2,55,3],[44,2,44,4],[45,2,45,3],[46,2,46,4],[47,2,47,3],[48,2,48,3],[49,2,49,4],[50,2,50,3],[51,2,51,4],[52,2,52,3],[53,2,53,3],[54,2,54,4],[43,2,43,3],[31,2,31,4],[32,2,32,3],[33,2,33,4],[35,2,35,4],[36,2,36,3],[37,2,37,4],[38,2,38,3],[39,2,39,4],[40,2,40,3],[41,2,41,3],[42,2,42,4],[30,2,30,3],[18,2,18,4],[19,2,19,3],[20,2,20,4],[21,2,21,3],[22,2,22,4],[24,2,24,4],[25,2,25,3],[26,2,26,4],[27,2,27,3],[28,2,28,3],[29,2,29,4],[17,2,17,3],[1,2,2,2],[6,2,6,3],[7,2,7,3],[8,2,8,4],[10,2,10,4],[11,2,11,3],[12,2,12,4],[13,2,13,3],[14,2,14,4],[15,2,15,3],[16,2,16,4]]}
[5,null,null,null,null,null,"*Pueden  Ocultar las Filas que no se utilicen."]
[null,null,{"$f":"General!B2","v":"PRESENTACIÓN DE PROYECTOS \nEN INVESTIGACIÓN DE POSGRADOS"},{"$f":"General!$H$2","v":"Fecha de Emisión: 2018/03/07"},{"$f":"General!$I$2","v":"IN-IV-F-14"},null,null,null,null,"Detalles:"]
[null,null,null,{"$f":"General!$H$3","v":"Revision N°:\n3"},{"$f":"\"Página \"&A1&\" de \"&Dt_TPG","v":"Página 5 de 11"},null,{"$f":"SUM(G5:G3524)","v":445},"<== Total de palabras"]
[]
[null,null,{"$f":"$Q$13","v":"."}]
["8b.-",0,"Consideraciones e implicaciones éticas de la investigación, bioética e integridad científica",null,"( Si  / No  )",null,"Palabras",null,null,null,null,null,"Validaciones"]
{"$rows_left_out":66}
{"sheet":"Metodología","index":6,"n_rows":44,"n_cols":8,"rows_kept":44,"cut":false,"hidden":false,"merged":[[30,2,30,4],[1,2,2,2],[24,2,24,4],[25,2,25,4],[26,2,26,4],[27,2,27,4],[12,2,12,4],[13,2,13,4],[14,2,14,4],[15,2,15,4],[16,2,16,4],[17,2,17,4],[6,2,6,4],[7,2,7,4],[8,2,8,4],[9,2,9,4],[10,2,10,4],[11,2,11,4],[28,2,28,4],[29,2,29,4],[18,2,18,4],[19,2,19,4],[20,2,20,4],[21,2,21,4],[22,2,22,4],[23,2,23,4],[33,2,33,4],[34,2,34,4],[35,2,35,4],[36,2,36,4],[37,2,37,4]]}
[5,null,null,null,null,null,"*Pueden  Ocultar las Filas que no se utilicen."]
[null,null,{"$f":"General!B2","v":"PRESENTACIÓN DE PROYECTOS \nEN INVESTIGACIÓN DE POSGRADOS"},{"$f":"General!$H$2","v":"Fecha de Emisión: 2018/03/07"},{"$f":"General!$I$2","v":"IN-IV-F-14"}]
[null,null,null,{"$f":"General!$H$3","v":"Revision N°:\n3"},{"$f":"\"Página \"&A1&\" de \"&Dt_TPG","v":"Página 5 de 11"},null,{"$f":"SUM(G7:G3504)","v":0},"<== Total de palabras"]
[]
["8.-","#","Metodología de la propuesta.",null,null,null,"Largo"]
[]
{"$rows_left_out":39}
{"sheet":"Cronograma","index":7,"n_rows":33,"n_cols":12,"rows_kept":33,"cut":false,"hidden":false,"merged":[[1,1,2,2]]}
[6,null,null,null,null,null,null,null,"*Pueden  Ocultar las Filas que no se utilicen.",null,null,{"$f":"(\"* Actualmente tiene \"&G7&\" meses de ejecución no superar los \"& G5&\" meses.\")","v":"* Actualmente tiene 0 meses de ejecución no superar los 24 meses."}]
[null,{"$f":"General!B2","v":"PRESENTACIÓN DE PROYECTOS \nEN INVESTIGACIÓN DE POSGRADOS"},null,{"$f":"General!$H$2","v":"Fecha de Emisión: 2018/03/07"},{"$f":"General!$I$2","v":"IN-IV-F-14"}]
[null,null,null,{"$f":"General!$H$3","v":"Revision N°:\n3"},{"$f":"\"Página \"&A1&\" de \"&Dt_TPG","v":"Página 6 de 11"}]
[]
["9.-","Cronograma de actividades a desarrollar",null,null,{"$f":"Integrantes!J6","v":24},null,{"$f":"E5","v":24},"Meses Maximo","Palabras"]
[]
{"$rows_left_out":28}
{"sheet":"Productos","index":8,"n_rows":88,"n_cols":26,"rows_kept":88,"cut":false,"hidden":false,"merged":[[1,1,2,5]]}
[7]
[null,{"$f":"Cronograma!B2","v":"PRESENTACIÓN DE PROYECTOS \nEN INVESTIGACIÓN DE POSGRADOS"},null,null,null,null,{"$f":"General!$H$2","v":"Fecha de Emisión: 2018/03/07"},{"$f":"General!$I$2","v":"IN-IV-F-14"}]
[null,null,null,null,null,null,{"$f":"General!$H$3","v":"Revision N°:\n3"},{"$f":"\"Página \"&A1&\" de \"&Dt_TPG","v":"Página 7 de 11"},null,null,"N","Abreviatura","IdClase","POS","IMP","Clase ","Tipo de Productos","Indicadores","o","Ok"]
[null,null,null,null,null,null,{"$f":"IF(H5=\"POS\",3,0)","v":3},null,null,null,101,"101- Artículo en Cuartil 1 (Q1) del SJR (Scopus) o del JCR (Web of Science)","GNC",60,null,"Productos de Generación de Nuevo Conocimiento (GNC)",null,"Copia del sometimiento y copia del artículo enviado a la revista",null,{"$f":"SUMIF($J$7:$J$28,$K4,$F$7:$F$28)","v":0}]
["10.-","Productividad comprometida",null,null,null,"Tipo de proyecto:",null,{"$f":"General!$H$1","v":"POS"},null,null,102,"102- Artículo en Cuartil 2 (Q2) del SJR (Scopus) o del JCR (Web of Science) WoS ","GNC",50,null,"Productos de Generación de Nuevo Conocimiento (GNC)",null,"Copia del sometimiento y copia del artículo enviado a la revista",null,{"$f":"SUMIF($J$7:$J$28,$K5,$F$7:$F$28)","v":0}]
[null,null,"Selección de topes comprometidos",null,null,null,null,null,null,null,103,"103- Artículo en Cuartil 3 (Q3) del SJR (Scopus) o del JCR (Web of Science) y/o Homologada B Colciencias","GNC",40,null,"Productos de Generación de Nuevo Conocimiento (GNC)",null,"Copia del sometimiento y copia del artículo enviado a la revista",null,0]
{"$rows_left_out":83}
{"sheet":"Integrantes","index":9,"n_rows":50,"n_cols":31,"rows_kept":50,"cut":false,"hidden":false,"merged":[[24,25,24,26],[35,1,37,1],[20,1,22,1],[23,1,25,1],[26,1,28,1],[29,1,31,1],[32,1,34,1],[21,5,21,7],[24,5,24,7],[27,5,27,7],[30,5,30,7],[33,5,33,7],[36,5,36,7],[11,1,13,1],[14,1,16,1],[17,1,19,1],[2,1,3,4],[2,6,2,7],[3,6,3,7],[8,1,10,1],[9,5,9,7],[10,3,10,7],[12,5,12,7],[18,5,18,7],[15,5,15,7]]}
[8]
[]
[null,{"$f":"Productos!B2","v":"PRESENTACIÓN DE PROYECTOS \nEN INVESTIGACIÓN DE POSGRADOS"},null,null,null,{"$f":"General!$H$2","v":"Fecha de Emisión: 2018/03/07"},"IN-IV-F-14",null,null,null,null,null,"Ok","Puntos","IP Max","IP Min","CO Max","CO Min","CR"]
[null,null,null,null,null,{"$f":"General!$H$3","v":"Revision N°:\n3"},{"$f":"\"Página \"&A1&\" de \"&Dt_TPG","v":"Página 8 de 11"},{"$f":"\"Página \"&A2&\" de \"&Dt_TPG","v":"Página  de 11"},null,20,null,null,{"$f":"IF(H6>=100,1,0)","v":0},{"$f":"S8","v":0},{"$f":"VLOOKUP($M$4,$M$8:$T$23,3,0)","v":0},{"$f":"VLOOKUP($M$4,$M$8:$T$23,4,0)","v":0},{"$f":"VLOOKUP($M$4,$M$8:$T$23,5,0)","v":0},{"$f":"VLOOKUP($M$4,$M$8:$T$23,6,0)","v":0},{"$f":"VLOOKUP($M$4,$M$8:$T$23,2,0)","v":30},{"$f":"VLOOKUP($M$4,$M$8:$T$23,8,0)","v":50}]
[]
["11.-","Investigadores Integrantes del proyecto.",null,null,null,{"$f":"Cel_TP","v":"POS"},{"$f":"Cel_Fac","v":"NT"},{"$f":"V_Max","v":0},null,{"$f":"IF(F6=\"FOR\",12,24)","v":24},null,null,null,null,null,null,null,null,null,null,null,null,"* Cuadro para tener relación entre Fincion y Tipo de Vinculo"]
{"$rows_left_out":45}
{"sheet":"Presupuesto","index":10,"n_rows":153,"n_cols":29,"rows_kept":153,"cut":false,"hidden":false,"merged":[[144,4,145,8],[142,4,142,8],[144,3,145,3],[109,1,111,1],[112,1,114,1],[115,1,117,1],[118,1,120,1],[121,1,123,1],[124,1,126,1],[130,1,132,1],[127,1,129,1],[94,1,96,1],[97,1,99,1],[100,1,102,1],[103,1,105,1],[106,1,108,1],[2,1,3,6],[49,4,49,5],[50,4,50,5],[84,4,84,5],[83,4,83,5],[6,3,6,8],[7,3,7,5],[7,7,7,8],[51,4,51,5],[52,4,52,5],[53,4,53,5],[54,4,54,5],[55,4,55,5],[56,4,56,5],[57,4,57,5],[58,4,58,5],[59,4,59,5],[60,4,60,5],[61,4,61,5],[67,4,67,5],[62,4,62,5],[63,4,63,5],[64,4,64,5],[65,4,65,5],[66,4,66,5]]}
[9,null,null,null,null,null,null,null,null,null,null,null,null,null,null,null,null,"Tabla de Topes"]
[null,null,null,null,null,null,null,null,null,null,null,null,"1.-> Limite presupuestal",{"$f":"IF(MIN(N6:P6)<1, 0,MIN(N6:P6))","v":0},null,null,null,"Clasif"]
[null,{"$f":"Integrantes!B3","v":"PRESENTACIÓN DE PROYECTOS \nEN INVESTIGACIÓN DE POSGRADOS"},null,null,null,null,null,{"$f":"General!$H$2","v":"Fecha de Emisión: 2018/03/07"},{"$f":"General!$I$2","v":"IN-IV-F-14"},null,null,null,null,"Limite Grupo","Limite Producto","Limite Convo",null,"A",{"$f":"IF($H$10=\"IMP\",250,100)","v":100}]
[null,null,null,null,null,null,null,{"$f":"General!$H$3","v":"Revision N°:\n3"},{"$f":"\"Página \"&$A$1&\" de \"&Dt_TPG","v":"Página 9 de 11"},null,null,null,"Mayor Grupo",{"$f":"Productos!G70","v":0},5,100,null,"A1",{"$f":"IF($H$10=\"IMP\",250,100)","v":100}]
[null,null,null,null,null,null,null,null,null,null,null,null,null,null,null,null,null,"B",{"$f":"IF($H$10=\"IMP\",250,100)","v":100}]
[null,null,null,null,null,null,null,null,null,null,null,null,1000000,{"$f":"IF(N8>3,P6,0)","v":0},{"$f":"M6*Productos!N60","v":0},{"$f":"M6*P4","v":100000000},null,"C",{"$f":"IF($H$10=\"IMP\",250,100)","v":100}]
{"$rows_left_out":148}
{"sheet":"Impactos","index":11,"n_rows":39,"n_cols":18,"rows_kept":39,"cut":false,"hidden":false,"merged":[[19,2,19,6],[20,2,20,6],[15,2,15,6],[1,2,2,4],[13,3,13,6],[14,2,14,6],[16,2,16,6],[17,2,17,6],[18,2,18,6],[7,5,7,6],[8,5,8,6],[9,2,9,6],[11,2,11,6],[12,3,12,6]]}
[10,null,null,null,null,null,null,null,"*Pueden  Ocultar las Filas que no se utilicen."]
[null,null,{"$f":"General!B2","v":"PRESENTACIÓN DE PROYECTOS \nEN INVESTIGACIÓN DE POSGRADOS"},null,null,{"$f":"General!$H$2","v":"Fecha de Emisión: 2018/03/07"},{"$f":"General!$I$2","v":"IN-IV-F-14"}]
[null,null,null,null,null,{"$f":"General!$H$3","v":"Revision N°:\n3"},{"$f":"\"Página \"&$A$1&\" de \"&Dt_TPG","v":"Página 10 de 11"},null,{"$f":"SUM(I7:I3500)","v":0},"<== Total de palabras"]
[]
["14.-","#","Impactos asociados a la propuesta."]
[]
{"$rows_left_out":34}
{"sheet":"Bibliografía","index":12,"n_rows":39,"n_cols":8,"rows_kept":39,"cut":false,"hidden":false,"merged":[[34,2,34,4],[23,2,23,4],[24,2,24,4],[25,2,25,4],[26,2,26,4],[27,2,27,4],[28,2,28,4],[29,2,29,4],[30,2,30,4],[31,2,31,4],[32,2,32,4],[33,2,33,4],[22,2,22,4],[11,2,11,4],[12,2,12,4],[13,2,13,4],[14,2,14,4],[15,2,15,4],[16,2,16,4],[17,2,17,4],[18,2,18,4],[19,2,19,4],[20,2,20,4],[21,2,21,4],[10,2,10,4],[1,2,2,2],[6,2,6,4],[7,2,7,4],[8,2,8,4],[9,2,9,4]]}
[11,null,null,null,null,null,"*Pueden  Ocultar las Filas que no se utilicen."]
[null,null,{"$f":"General!B2","v":"PRESENTACIÓN DE PROYECTOS \nEN INVESTIGACIÓN DE POSGRADOS"},{"$f":"General!$H$2","v":"Fecha de Emisión: 2018/03/07"},{"$f":"General!$I$2","v":"IN-IV-F-14"}]
[null,null,null,{"$f":"General!$H$3","v":"Revision N°:\n3"},{"$f":"\"Página \"&$A$1&\" de \"&Dt_TPG","v":"Página 11 de 11"},null,{"$f":"SUM(G7:G3500)","v":0},"<== Total de palabras"]
[]
["15.-","#","Bibliografía de la propuesta.",null,null,null,"Largo"]
[]
{"$rows_left_out":33}