{"text_format":"1","workbook":"xlsx","n_sheets":11,"sheets":["Dt","General","Resumen","Estado_del_arte","Objetivos","Cronograma","Productos","Integrantes","Presupuesto","Impactos","Bibliografía"],"not_rendered":{"charts":0,"images":1,"macros":1,"external_links":0,"defined_names":50,"comments":5,"pivot_tables":0},"unopened":[],"bounds":{"document_bytes":16777216,"sheet_cells":100000,"rows_first":2000,"rows_last":500,"rows_between":2000,"halvings":0,"cell_chars":16384,"cell_head_chars":4096},"cells_cut":0,"cells_raw":0,"read":"whole","date_system":"1900"}

{"sheet":"Dt","index":0,"n_rows":2004,"n_cols":648,"rows_kept":2004,"cut":false,"hidden":true,"merged":[]}
[null,"No eliminar Hoja … :)))",null,null,null,null,null,null,null,null,null,null,null,null,null,null,null,null,null,null,null,null,null,null,null,null,"No","Campo ","1_Opcion","2_Opcion",null,"Avaya1719",null,null,null,null,null,null,null,null,null,null,"http://scienti.colciencias.gov.co:8080/gruplac/jsp/visualiza/visualizagr.jsp?nro="]
[null,null,null,null,null,null,null,null,null,null,null,null,null,null,null,null,null,null,null,null,null,null,null,null,null,null,1,"Sedes","Calle 100",null,null,null,null,null,null,null,null,null,null,null,null,null,null,null,null,"BB",null,{"$f":"MIN(BD3:BD293)","v":4},{"$f":"MAX(BD3:BD293)","v":293}]
[null,null,null,null," ",null,null,null,null,null,null,null,null,null,null,null,null,null,null,null,null,null,null,null,null,null,2,"Sedes","Campus Cajica",null,null,null,null,null,null,null,"Hoja",null,null,"Hoja","FAC","Grupo","COD","Clas","Link","Lineas","Fila Grupo","Min","Max","FAC",null,null,"COD","Linea","Cel","Fila","E:Gp",null,"Código de Grupo",null,null,null,null,"Hora","Agente","Agente"]
[null,null,null,null,null,null,null,null,null,null,null,null,null,null,null,null,null,null,null,null,null,null,null,null,null,null,3,"Sedes","Medicina",null,null,null,null,null,null,null,3,1,{"$f":"COUNTIF($AN$4:$AN$806,AL4)","v":1},1,"CIAS","Fitoplasmas y Virus","COL0028687","C","http://scienti.colciencias.gov.co:8085/gruplac/jsp/visualiza/visualizagr.jsp?nro=00000000008436",{"$f":"$AT$2&AV4&\":\"&$AT$2&AW4","v":"BB10:BB11"},{"$f":"ROW()","v":4},{"$f":"MINA(IF(AQ4=$BA$4:$BA$401,$BD$4:$BD$401))","v":10},{"$f":"MAXA(IF(AQ4=$BA$4:$BA$401,$BD$4:$BD$401))","v":11},{"$f":"AO4","v":"CIAS"},null,null,"COL0049659","Medios de comunicación, educación y salud",{"$f":"COUNTIF(BA$4:BA4,BA4)","v":1},{"$f":"ROW()","v":4},{"$f":"COUNTIF($AQ$3:$AQ$83,BA4)","v":1},null,"COL0015722",{"$f":"COUNTIF($AQ$4:$AQ$75,BG4)","v":1},null,null,null,"19:54:00","a","a",{"$f":"DMIN(BL3:BM12,\"hora\",BN3:BN4)","v":0.4548611111111111},"|"]
[null,null,null,null,null,null,null,null,null,null,null,null,null,null,null,null,null,null,null,null,null,null,null,null,null,null,4,"Sedes","Otros",null,null,null,null,null,null,null,4,2,1,2,"CIAS","Grupo de investigación en Biodiversidad y ecología de abejas silvestres","COL0031959","B","http://scienti.colciencias.gov.co:8085/gruplac/jsp/visualiza/visualizagr.jsp?nro=00000000001366",{"$f":"$AT$2&AV5&\":\"&$AT$2&AW5","v":"BB12:BB16"},{"$f":"ROW()","v":5},{"$f":"MINA(IF(AQ5=$BA$4:$BA$401,$BD$4:$BD$401))","v":12},{"$f":"MAXA(IF(AQ5=$BA$4:$BA$401,$BD$4:$BD$401))","v":16},{"$f":"AO5","v":"CIAS"},null,null,"COL0049659","Salud Pública y Nutrición, Prevención de la Enfermedad y Promoción de la Salud",{"$f":"COUNTIF(BA$4:BA5,BA5)","v":2},{"$f":"ROW()","v":5},1,null,"COL0026486",1,null,null,null,"09:54:00","b","B"]
[null,null,null,null,null,null,null,null,null,null,null,null,null,null,null,null,null,null,null,null,null,null,null,null,null,null,1,"Facultad","Ciencias Básicas","CIAS",null,null,null,null,null,null,12,3,1,3,"CIAS","MATRIX","COL0039321","C","http://scienti.colciencias.gov.co:8085/gruplac/jsp/visualiza/visualizagr.jsp?nro=00000000002208","BB38:BB42",{"$f":"ROW()","v":6},{"$f":"MINA(IF(AQ6=$BA$4:$BA$401,$BD$4:$BD$401))","v":38},{"$f":"MAXA(IF(AQ6=$BA$4:$BA$401,$BD$4:$BD$401))","v":42},"CIAS",null,null,"COL0062704","Procesos Organizacionales (Prospectiva de las Organizaciones), Programáticos y Políticos para la Promoción del Desarrollo.",{"$f":"COUNTIF(BA$4:BA6,BA6)","v":1},{"$f":"ROW()","v":6},1,null,"COL0027367",1,null,null,null,"17:54:00","c","c"]
[null,null,null,null,null,null,null,null,null,null,null,null,null,null,null,null,null,null,null,null,null,null,null,null,null,null,2,"Facultad","Ciencias Económicas","ECO",null,null,null,null,null,null,18,4,1,4,"CIAS","Desarrollo e integración de estrategias alternativas para la protección de cultivos de importancia económica, con énfasis en control biológico.","COL0032278","A","http://scienti.colciencias.gov.co:8085/gruplac/jsp/visualiza/visualizagr.jsp?nro=00000000001399","BB64:BB65",{"$f":"ROW()","v":7},{"$f":"MINA(IF(AQ7=$BA$4:$BA$401,$BD$4:$BD$401))","v":64},{"$f":"MAXA(IF(AQ7=$BA$4:$BA$401,$BD$4:$BD$401))","v":65},"CIAS",null,null,"COL0062704","Prospectiva de las Organizaciones",{"$f":"COUNTIF(BA$4:BA7,BA7)","v":2},{"$f":"ROW()","v":7},1,null,"COL0018448",1,null,null,null,"10:55:00","a"]
[null,null,null,null,null,null,null,null,null,null,null,null,null,null,null,null,null,null,null,null,null,null,null,null,null,null,3,"Facultad","Derecho","DER",null,null,null,null,null,null,26,5,1,5,"CIAS","Grupo de Micología y Fitopatologia ","COL0013719","A1","http://scienti.colciencias.gov.co:8085/gruplac/jsp/visualiza/visualizagr.jsp?nro=00000000001127","BB107:BB111",{"$f":"ROW()","v":8},{"$f":"MINA(IF(AQ8=$BA$4:$BA$401,$BD$4:$BD$401))","v":107},{"$f":"MAXA(IF(AQ8=$BA$4:$BA$401,$BD$4:$BD$401))","v":111},"CIAS",null,null,"COL0062704","Responsabilidad Ambiental",{"$f":"COUNTIF(BA$4:BA8,BA8)","v":3},{"$f":"ROW()","v":8},1,null,"COL0028767",1,null,null,null,"11:45:00","a"]
[null,null,null,null,null,null,null,null,null,null,null,null,null,null,null,null,null,null,null,null,null,null,null,null,null,null,4,"Facultad","Educación y Humanidades","HUM",null,null,null,null,null,null,28,6,1,6,"CIAS","Fitopatologia molecular","COL0086179","C","http://scienti.colciencias.gov.co:8085/gruplac/jsp/visualiza/visualizagr.jsp?nro=00000000007907","BB118:BB120",{"$f":"ROW()","v":9},{"$f":"MINA(IF(AQ9=$BA$4:$BA$401,$BD$4:$BD$401))","v":118},{"$f":"MAXA(IF(AQ9=$BA$4:$BA$401,$BD$4:$BD$401))","v":120},"CIAS",null,null,"COL0062704","Responsabilidad Social Empresarial",{"$f":"COUNTIF(BA$4:BA9,BA9)","v":4},{"$f":"ROW()","v":9},1,null,"COL0028918",1,null,null,null,"15:12:00","b"]
[null,null,null,null,null,null,null,null,null,null,null,null,null,null,null,null,null,null,null,null,null,null,null,null,null,null,5,"Facultad","Estudios a Distancia","DIS",null,null,null,null,null,null,30,7,1,7,"CIAS","Estadística, Control y Optimización","COL0136423","B","http://scienti.colciencias.gov.co:8085/gruplac/jsp/visualiza/visualizagr.jsp?nro=00000000013845","BB125:BB129",{"$f":"ROW()","v":10},{"$f":"MINA(IF(AQ10=$BA$4:$BA$401,$BD$4:$BD$401))","v":125},{"$f":"MAXA(IF(AQ10=$BA$4:$BA$401,$BD$4:$BD$401))","v":129},"CIAS",null,null,"COL0028687","Fitoplasmas",{"$f":"COUNTIF(BA$4:BA10,BA10)","v":1},{"$f":"ROW()","v":10},1,null,"COL0031824",1,null,null,null,"23:12:00","b"]
{"$rows_left_out":1995}
{"sheet":"General","index":1,"n_rows":48,"n_cols":24,"rows_kept":48,"cut":false,"hidden":false,"merged":[[45,1,45,8],[32,2,32,8],[36,2,36,8],[20,2,20,8],[22,3,22,8],[24,2,24,8],[26,3,26,8],[28,2,28,8],[33,2,33,6],[34,2,34,6],[35,2,35,6],[18,3,18,8],[14,2,14,5],[14,7,14,8],[1,1,2,6],[8,1,8,8],[9,2,9,5],[9,7,9,8],[10,7,10,8],[10,2,10,5],[6,2,6,5],[6,7,6,8],[11,2,11,5],[11,7,11,8],[12,2,12,8],[13,2,13,7]]}
[1,null,null,null,null,null,null,{"$f":"IFERROR(VLOOKUP($C$7,Dt!AD79:AE82,2,0),\"INV\")","v":"INO"},{"$f":"IFERROR(VLOOKUP($C$15,Dt!$AC$6:$AD$13,2,0),\"NT\")","v":"NT"},null,null,null,null,7,"A",{"$f":"COUNTIF($I$20:$I$28,O1)","v":1},{"$f":"IF(P1>0,$N1,0)","v":7},null,null,null,null,null,null,"Número de Paginas del documento final , se puede ajustar."]
[null,"PRESENTACIÓN DE PROPUESTAS DE IDEAS \nINNOVADORAS",null,null,null,null,null,"Fecha de Emisión: 2018/03/06","IN-IE-F-7",null,null,null,null,6,"A1",{"$f":"COUNTIF($I$20:$I$28,O2)","v":0},0,null,null,null,null,null,null,11]
[null,null,null,null,null,null,null,"Revision N°:\n4",{"$f":"\"Página \"&A1&\" de \"&Dt_TPG","v":"Página 1 de 11"},null,null,null,null,5,"B",0,0,null,"Innovación"]
[null,null,null,null,null,null,null,null,null,null,null,null,null,null,null,0,0]
["1.-","Información general del proyecto.",null,null,null,null,null,null,"Vrs. 09-2018",null,null,null,null,4,"C",0,0,null,null,null,null,null,null,"Hoy es "]
[null,null,null,null,null,null,null,null,null,null,null,null,null,null,null,0,0]
[null,"Convocatoria:","Innovación",null,null,null,"Codigo / Radicado",null,null,null,null,null,null,3,"D",0,0,null,null,null,null,null,null,{"$f":"NOW()","v":"2018-09-18T11:56:30.810"}]
[null,null,null,null,null,null,null,null,null,null,null,null,null,2,"R",0,0]
[null,null,null,null,null,null,null,null,null,null,null,null,null,1,"NR",0,0]
[null,"Líder: ",null,null,null,null,"Teléfonos :",null,null,null,null,null,null,null,null,null,null,null,null,null,null,null,null,"2017-03-02"]
{"$rows_left_out":39}
{"sheet":"Resumen","index":2,"n_rows":127,"n_cols":9,"rows_kept":127,"cut":false,"hidden":false,"merged":[[119,2,119,4],[120,2,120,4],[121,2,121,4],[122,2,122,4],[123,2,123,4],[114,2,114,4],[115,2,115,4],[116,2,116,4],[117,2,117,4],[118,2,118,4],[93,2,93,4],[94,2,94,4],[95,2,95,4],[96,2,96,4],[97,2,97,4],[88,2,88,4],[89,2,89,4],[90,2,90,4],[91,2,91,4],[92,2,92,4],[80,2,80,4],[81,2,81,4],[82,2,82,4],[83,2,83,4],[75,2,75,4],[76,2,76,4],[77,2,77,4],[78,2,78,4],[79,2,79,4],[67,2,67,4],[68,2,68,4],[69,2,69,4],[70,2,70,4],[74,2,74,4],[62,2,62,4],[63,2,63,4],[64,2,64,4],[65,2,65,4],[66,2,66,4],[54,2,54,4],[55,2,55,4],[56,2,56,4],[57,2,57,4],[61,2,61,4],[49,2,49,4],[50,2,50,4],[51,2,51,4],[52,2,52,4],[53,2,53,4],[26,2,26,4],[27,2,27,4],[28,2,28,4],[29,2,29,4],[107,2,107,4],[40,2,40,4],[41,2,41,4],[42,2,42,4],[43,2,43,4],[34,2,34,4],[35,2,35,4],[36,2,36,4],[37,2,37,4],[38,2,38,4],[39,2,39,4],[48,2,48,4],[108,2,108,4],[109,2,109,4],[110,2,110,4],[102,2,102,4],[103,2,103,4],[104,2,104,4],[105,2,105,4],[106,2,106,4],[8,2,8,4],[7,2,7,4],[1,2,2,2],[6,2,6,4],[101,2,101,4],[13,2,13,4],[12,2,12,4],[11,2,11,4],[10,2,10,4],[9,2,9,4],[20,2,20,4],[21,2,21,4],[22,2,22,4],[23,2,23,4],[24,2,24,4],[25,2,25,4]]}
[2,null,null,null,null,null,"*Pueden  Ocultar las Filas que no se utilicen."]
[null,null,{"$f":"General!B2","v":"PRESENTACIÓN DE PROPUESTAS DE IDEAS \nINNOVADORAS"},{"$f":"General!$H$2","v":"Fecha de Emisión: 2018/03/06"},{"$f":"General!$I$2","v":"IN-IE-F-7"},null,{"$f":"SUM(G7:G14)","v":0},"<=== N° palabras en total"]
[null,null,null,{"$f":"General!$H$3","v":"Revision N°:\n4"},{"$f":"\"Página \"&A1&\" de \"&Dt_TPG","v":"Página 2 de 11"},null,"Palabras","Largo L","Limite"]
[]
["4.-","#","Resumen de la propuesta ",null,null,null,{"$f":"SUM(G6:G15)","v":0},{"$f":"SUM(H6:H15)","v":0},30000]
[null,null,null,null,null,null,null,null,{"$f":"I5","v":30000}]
[null,{"$f":"ROW()-6","v":1},null,null,null,null,{"$f":"IF(C7=\"\",0,LEN(TRIM(C7))-LEN(SUBSTITUTE(TRIM(C7),\" \",\"\"))+1)","v":0},{"$f":"LEN(C7)","v":0},{"$f":"I6","v":30000}]
[null,{"$f":"ROW()-6","v":2},null,null,null,null,{"$f":"IF(C8=\"\",0,LEN(TRIM(C8))-LEN(SUBSTITUTE(TRIM(C8),\" \",\"\"))+1)","v":0},{"$f":"LEN(C8)","v":0},30000]
[null,3,null,null,null,null,{"$f":"IF(C9=\"\",0,LEN(TRIM(C9))-LEN(SUBSTITUTE(TRIM(C9),\" \",\"\"))+1)","v":0},0,30000]
[null,4,null,null,null,null,0,0,30000]
{"$rows_left_out":118}
{"sheet":"Estado_del_arte","index":3,"n_rows":41,"n_cols":8,"rows_kept":41,"cut":false,"hidden":false,"merged":[[36,2,36,4],[1,2,2,2],[31,2,31,4],[32,2,32,4],[33,2,33,4],[34,2,34,4],[19,2,19,4],[20,2,20,4],[21,2,21,4],[22,2,22,4],[23,2,23,4],[24,2,24,4],[13,2,13,4],[14,2,14,4],[15,2,15,4],[16,2,16,4],[17,2,17,4],[35,2,35,4],[25,2,25,4],[26,2,26,4],[27,2,27,4],[28,2,28,4],[29,2,29,4],[30,2,30,4],[18,2,18,4],[12,2,12,4],[7,2,7,4],[8,2,8,4],[9,2,9,4],[10,2,10,4],[11,2,11,4]]}
[3,null,null,null,null,null,"*Pueden  Ocultar las Filas que no se utilicen."]
[null,null,{"$f":"General!B2","v":"PRESENTACIÓN DE PROPUESTAS DE IDEAS \nINNOVADORAS"},{"$f":"General!$H$2","v":"Fecha de Emisión: 2018/03/06"},{"$f":"General!$I$2","v":"IN-IE-F-7"}]
[null,null,null,{"$f":"General!$H$3","v":"Revision N°:\n4"},{"$f":"\"Página \"&A1&\" de \"&Dt_TPG","v":"Página 3 de 11"},null,{"$f":"SUM(G8:G3501)","v":0},"<== Total de palabras"]
[]
["6.-","#","Estado del arte de la propuesta.",null,null,null,"Largo"]
["c.-","#","Antecedentes cientificos y tecnologicos.",null,null,null,{"$f":"SUM(G7:G328)","v":0},"<=== Palabras en total"]
[]
[null,{"$f":"ROW()-6","v":2},null,null,null,null,{"$f":"IF(C8=\"\",0,LEN(TRIM(C8))-LEN(SUBSTITUTE(TRIM(C8),\" \",\"\"))+1)","v":0}]
[null,{"$f":"ROW()-6","v":3},null,null,null,null,{"$f":"IF(C9=\"\",0,LEN(TRIM(C9))-LEN(SUBSTITUTE(TRIM(C9),\" \",\"\"))+1)","v":0}]
[null,4,null,null,null,null,0]
{"$rows_left_out":32}
{"sheet":"Objetivos","index":4,"n_rows":23,"n_cols":8,"rows_kept":23,"cut":false,"hidden":false,"merged":[[18,2,18,4],[17,2,17,4],[22,2,22,4],[21,2,21,4],[20,2,20,4],[19,2,19,4],[1,1,2,2],[7,2,7,4],[8,2,8,4],[9,2,9,4],[10,2,10,4],[6,1,6,4],[11,2,11,4],[13,2,13,4],[14,2,14,4],[15,2,15,4],[16,2,16,4],[12,2,12,4]]}
[4]
[null,{"$f":"General!B2","v":"PRESENTACIÓN DE PROPUESTAS DE IDEAS \nINNOVADORAS"},null,{"$f":"General!$H$2","v":"Fecha de Emisión: 2018/03/06"},{"$f":"General!$I$2","v":"IN-IE-F-7"}]
[null,null,null,{"$f":"General!$H$3","v":"Revision N°:\n4"},{"$f":"\"Página \"&A1&\" de \"&Dt_TPG","v":"Página 4 de 11"},null,{"$f":"SUM(G7:G3500)","v":0},"<== Total de palabras"]
[]
["7.-","Objetivos de la propuesta.",null,null,null,null,"Largo"]
[]
[null,"*El especio del Item (0) Cero es para definir el objetivo general los demás corresponden a objetivos especificos "]
[null,{"$f":"ROW()-8","v":0},null,null,null,null,{"$f":"IF(C8=\"\",0,LEN(TRIM(C8))-LEN(SUBSTITUTE(TRIM(C8),\" \",\"\"))+1)","v":0}]
[null,{"$f":"ROW()-8","v":1},null,null,null,null,0]
[null,2,null,null,null,null,0]
{"$rows_left_out":14}
{"sheet":"Cronograma","index":5,"n_rows":33,"n_cols":12,"rows_kept":33,"cut":false,"hidden":false,"merged":[[1,1,2,2]]}
[6,null,null,null,null,null,null,null,"*Pueden  Ocultar las Filas que no se utilicen.",null,null,{"$f":"(\"* Actualmente tiene \"&G7&\" meses de ejecución no superar los \"& G5&\" meses.\")","v":"* Actualmente tiene 0 meses de ejecución no superar los 12 meses."}]
[null,{"$f":"General!B2","v":"PRESENTACIÓN DE PROPUESTAS DE IDEAS \nINNOVADORAS"},null,{"$f":"General!$H$2","v":"Fecha de Emisión: 2018/03/06"},{"$f":"General!$I$2","v":"IN-IE-F-7"}]
[null,null,null,{"$f":"General!$H$3","v":"Revision N°:\n4"},{"$f":"\"Página \"&A1&\" de \"&Dt_TPG","v":"Página 6 de 11"}]
[]
["9.-","Cronograma de actividades a desarrollar",null,null,{"$f":"Integrantes!J6","v":12},null,{"$f":"E5","v":12},"Meses Maximo","Palabras"]
[]
[null,"No","Descripción básica de la actividad","Mes de Inicio","Duración en mes",null,{"$f":"MAX(G8:G27)","v":0},"Meses de ejecición actuales",{"$f":"SUM(I8:I27)","v":0},"<== Total de palabras"]
[null,{"$f":"ROW()-7","v":1},null,null,null,null,{"$f":"SUM(D8:E8)","v":0},null,{"$f":"IF(C8=\"\",0,LEN(TRIM(C8))-LEN(SUBSTITUTE(TRIM(C8),\" \",\"\"))+1)","v":0}]
[null,{"$f":"ROW()-7","v":2},null,null,null,null,{"$f":"SUM(D9:E9)","v":0},null,{"$f":"IF(C9=\"\",0,LEN(TRIM(C9))-LEN(SUBSTITUTE(TRIM(C9),\" \",\"\"))+1)","v":0}]
[null,3,null,null,null,null,0,null,0]
{"$rows_left_out":24}
{"sheet":"Productos","index":6,"n_rows":29,"n_cols":17,"rows_kept":29,"cut":false,"hidden":false,"merged":[[14,3,14,4],[12,3,12,4],[13,3,13,4],[5,3,5,4],[6,3,6,4],[7,3,7,4],[8,3,8,4],[1,1,2,3],[25,2,25,4],[26,2,26,4],[27,2,27,4],[28,2,28,4],[19,2,19,4],[20,2,20,4],[21,2,21,4],[22,2,22,4],[23,2,23,4],[24,2,24,4],[15,3,15,4],[16,3,16,4],[9,3,9,4],[10,3,10,4],[11,3,11,4]]}
[7]
[null,{"$f":"General!B2","v":"PRESENTACIÓN DE PROPUESTAS DE IDEAS \nINNOVADORAS"},null,null,{"$f":"General!$H$2","v":"Fecha de Emisión: 2018/03/06"},{"$f":"General!$I$2","v":"IN-IE-F-7"}]
[null,null,null,null,{"$f":"General!$H$3","v":"Revision N°:\n4"},{"$f":"\"Página \"&A1&\" de \"&Dt_TPG","v":"Página 7 de 11"},null,null,"N","Abreviatura","IdClase","M1","M2","M3","M4","Indicadores","Ok"]
[null,null,null,null,{"$f":"IF(F5=\"INV\",3,4)","v":4},null,null,null,{"$f":"ROW()-3","v":1},"Estudio de mercado","NA",0,0,0,0,"Documento",{"$f":"SUMIFS(#REF!,$C$7:$C$26,$J4)","v":{"$error":"#REF!"}}]
["10.-","Productividad comprometida",null,null,null,{"$f":"General!$H$1","v":"INO"},null,null,{"$f":"ROW()-3","v":2},"Hoja de Ruta (Transferencia)","NA",0,0,0,0,"Documento",{"$f":"SUMIFS(#REF!,$C$7:$C$26,$J5)","v":{"$error":"#REF!"}}]
[null,"N°","Resultado/Producto esperado","Descripción o detalles del producto esperado",null,"Indicador",null,null,3,"Modelo de Negocio","NA",0,0,0,0,"Documento",{"$f":"SUMIFS(#REF!,$C$7:$C$26,$J6)","v":{"$error":"#REF!"}}]
[null,{"$f":"ROW()-6","v":1},null,null,null,{"$f":"IFERROR(VLOOKUP($C7,J3:$Q$14,7,0),\" \")","v":" "},null,null,4,"Portafolio -Producto o Servicio","NA",0,0,0,0,"Brochure ",{"$f":"SUMIFS(#REF!,$C$7:$C$26,$J7)","v":{"$error":"#REF!"}}]
[null,{"$f":"ROW()-6","v":2},null,null,null,{"$f":"IFERROR(VLOOKUP($C8,J4:$Q$14,7,0),\" \")","v":" "},null,null,5,"Capacitación en Marketing","NA",0,0,0,0,"Certificación ",{"$f":"SUMIFS(#REF!,$C$7:$C$26,$J8)","v":{"$error":"#REF!"}}]
[null,3,null,null,null,{"$f":"IFERROR(VLOOKUP($C9,J4:$Q$14,7,0),\" \")","v":" "},null,null,6,"Prototipo Escalado y Validado","NA",0,0,0,0,"Pruebas, Fotos o videos que evidencien la funcionalidad y validación del mismo",{"$f":"SUMIFS(#REF!,$C$7:$C$26,$J9)","v":{"$error":"#REF!"}}]
[null,4,null,null,null,{"$f":"IFERROR(VLOOKUP($C10,J4:$Q$14,7,0),\" \")","v":" "},null,null,7,"Caracterización","NA",0,0,0,0,"Ficha Técnica",{"$f":"SUMIFS(#REF!,$C$7:$C$26,$J10)","v":{"$error":"#REF!"}}]
{"$rows_left_out":20}
{"sheet":"Integrantes","index":7,"n_rows":38,"n_cols":29,"rows_kept":38,"cut":false,"hidden":false,"merged":[[37,6,37,7],[10,6,10,7],[24,25,24,26],[35,1,37,1],[20,1,22,1],[23,1,25,1],[26,1,28,1],[29,1,31,1],[32,1,34,1],[21,5,21,7],[24,5,24,7],[33,5,33,7],[36,5,36,7],[27,5,27,7],[11,1,13,1],[14,1,16,1],[17,1,19,1],[13,6,13,7],[16,6,16,7],[19,6,19,7],[2,1,3,4],[2,6,2,7],[3,6,3,7],[8,1,10,1],[9,5,9,7],[31,6,31,7],[34,6,34,7],[30,5,30,7],[18,5,18,7],[12,5,12,7],[15,5,15,7],[22,6,22,7],[25,6,25,7],[28,6,28,7]]}
[8]
[]
[null,{"$f":"General!B2","v":"PRESENTACIÓN DE PROPUESTAS DE IDEAS \nINNOVADORAS"},null,null,null,{"$f":"General!$H$2","v":"Fecha de Emisión: 2018/03/06"},"IN-IV-F-14"]
[null,null,null,null,null,{"$f":"General!$H$3","v":"Revision N°:\n4"},{"$f":"\"Página \"&A1&\" de \"&Dt_TPG","v":"Página 8 de 11"},{"$f":"\"Página \"&A2&\" de \"&Dt_TPG","v":"Página  de 11"},null,20]
[]
["11.-","Investigadores Integrantes del proyecto.",null,null,null,{"$f":"Cel_TP","v":"INO"},{"$f":"Cel_Fac","v":"NT"},{"$f":"V_Max","v":0},null,{"$f":"IF(F6=\"INO\",12,6)","v":12},null,null,null,null,null,null,null,null,null,null,null,null,"* Cuadro para tener relación entre Fincion y Tipo de Vinculo"]
[]
[null,"No","Identificacion","Nombres","Apellidos","Nivel Academico","Mes","Horas",null,"Max","Min",null,null,null,null,null,null,null,null,null,null,null,"Funcion ","y","Vinculo","Mes","Fila","Max","Min"]
[null,1,null,null,null,null,{"$f":"J6","v":12},1,null,6,1,null,null,null,null,null,null,null,null,null,null,null,"Innovador Principal",{"$f":"$X$8&\"9:\"&$X$8&\"10\"","v":"y9:y10"},"Doc. Carrera TC",{"$f":"G9","v":12},{"$f":"ROW()","v":9},8,4]
[null,null,"Funcion :","Innovador Principal",null,null,null,null,null,{"$f":"IFERROR(VLOOKUP($F10,V_IdNBC,2,0),0)","v":0},null,null,null,null,null,null,null,null,null,null,null,null,"Innovador Principal",{"$f":"$X$8&\"9:\"&$X$8&\"10\"","v":"y9:y10"},"Doc. Carrera MT",{"$f":"Z9","v":12},{"$f":"ROW()","v":10},8,4]
{"$rows_left_out":29}
{"sheet":"Presupuesto","index":8,"n_rows":101,"n_cols":17,"rows_kept":101,"cut":false,"hidden":false,"merged":[[66,4,66,5],[61,4,61,5],[62,4,62,5],[63,4,63,5],[64,4,64,5],[65,4,65,5],[56,4,56,5],[57,4,57,5],[58,4,58,5],[59,4,59,5],[60,4,60,5],[98,4,99,8],[96,4,96,8],[2,1,3,6],[48,4,48,5],[49,4,49,5],[68,4,68,5],[67,4,67,5],[6,3,6,8],[7,3,7,5],[7,7,7,8],[50,4,50,5],[51,4,51,5],[52,4,52,5],[53,4,53,5],[54,4,54,5],[55,4,55,5]]}
[9]
[null,null,null,null,null,null,null,null,null,null,null,null,"Monto Financiable ",{"$f":"IFERROR(VLOOKUP(N4,$P$15:$Q$18,2,0),Q15)","v":20000000}]
[null,{"$f":"General!B2","v":"PRESENTACIÓN DE PROPUESTAS DE IDEAS \nINNOVADORAS"},null,null,null,null,null,{"$f":"General!$H$2","v":"Fecha de Emisión: 2018/03/06"},{"$f":"General!$I$2","v":"IN-IE-F-7"}]
[null,null,null,null,null,null,null,{"$f":"General!$H$3","v":"Revision N°:\n4"},{"$f":"\"Página \"&$A$1&\" de \"&Dt_TPG","v":"Página 9 de 11"},null,null,null,null,{"$f":"LEFT(General!C13,5)","v":"Mod-1"}]
[]
[]
[null,"T","Título de la Propuesta :",{"$f":"General!B9","v":0}]
[null,"L","Lider responsable",{"$f":"General!C10","v":0},null,null,"Codigo VICEIN:",{"$f":"General!H7","v":0}]
[]
["12.-","Presupuesto rubro personal asocidado a la propuesta",null,null,null,null,{"$f":"V_Max","v":0},{"$f":"Cel_TP","v":"INO"},{"$f":"Gp_Max","v":"A"}]
{"$rows_left_out":92}
{"sheet":"Impactos","index":9,"n_rows":39,"n_cols":12,"rows_kept":39,"cut":false,"hidden":false,"merged":[[1,2,2,2]]}
[10,null,null,null,null,null,"*Pueden  Ocultar las Filas que no se utilicen."]
[null,null,{"$f":"General!B2","v":"PRESENTACIÓN DE PROPUESTAS DE IDEAS \nINNOVADORAS"},{"$f":"General!$H$2","v":"Fecha de Emisión: 2018/03/06"},{"$f":"General!$I$2","v":"IN-IE-F-7"}]
[null,null,null,{"$f":"General!$H$3","v":"Revision N°:\n4"},{"$f":"\"Página \"&$A$1&\" de \"&Dt_TPG","v":"Página 10 de 11"},null,{"$f":"SUM(G7:G3500)","v":1},"<== Total de palabras"]
[]
["14.-","#","Impactos asociados a la propuesta.",null,null,null,"Largo"]
[]
[null,"N°","Impacto","Categoria","Plazo",null,{"$f":"IF(C7=\"\",0,LEN(TRIM(C7))-LEN(SUBSTITUTE(TRIM(C7),\" \",\"\"))+1)","v":1},null,null,"No","Tipo","Duración"]
[null,{"$f":"ROW()-7","v":1},null,null,null,null,{"$f":"IF(C8=\"\",0,LEN(TRIM(C8))-LEN(SUBSTITUTE(TRIM(C8),\" \",\"\"))+1)","v":0},null,null,1,"Fin de la pobreza","Corto (1 año)"]
[null,{"$f":"ROW()-7","v":2},null,null,null,null,0,null,null,{"$f":"J8+1","v":2},"Hambre Cero (0)","Medio (2 años)"]
[null,3,null,null,null,null,0,null,null,{"$f":"J9+1","v":3},"Salud y bienestar","Largo (3 años)"]
{"$rows_left_out":30}
{"sheet":"Bibliografía","index":10,"n_rows":39,"n_cols":8,"rows_kept":39,"cut":false,"hidden":false,"merged":[[34,2,34,4],[23,2,23,4],[24,2,24,4],[25,2,25,4],[26,2,26,4],[27,2,27,4],[28,2,28,4],[29,2,29,4],[30,2,30,4],[31,2,31,4],[32,2,32,4],[33,2,33,4],[22,2,22,4],[11,2,11,4],[12,2,12,4],[13,2,13,4],[14,2,14,4],[15,2,15,4],[16,2,16,4],[17,2,17,4],[18,2,18,4],[19,2,19,4],[20,2,20,4],[21,2,21,4],[10,2,10,4],[1,2,2,2],[6,2,6,4],[7,2,7,4],[8,2,8,4],[9,2,9,4]]}
[11,null,null,null,null,null,"*Pueden  Ocultar las Filas que no se utilicen."]
[null,null,{"$f":"General!B2","v":"PRESENTACIÓN DE PROPUESTAS DE IDEAS \nINNOVADORAS"},{"$f":"General!$H$2","v":"Fecha de Emisión: 2018/03/06"},{"$f":"General!$I$2","v":"IN-IE-F-7"}]
[null,null,null,{"$f":"General!$H$3","v":"Revision N°:\n4"},{"$f":"\"Página \"&$A$1&\" de \"&Dt_TPG","v":"Página 11 de 11"},null,{"$f":"SUM(G7:G3500)","v":0},"<== Total de palabras"]
[]
["15.-","#","Bibliografía de la propuesta.",null,null,null,"Largo"]
[]
[null,{"$f":"ROW()-6","v":1},null,null,null,null,{"$f":"IF(C7=\"\",0,LEN(TRIM(C7))-LEN(SUBSTITUTE(TRIM(C7),\" \",\"\"))+1)","v":0}]
[null,{"$f":"ROW()-6","v":2},null,null,null,null,{"$f":"IF(C8=\"\",0,LEN(TRIM(C8))-LEN(SUBSTITUTE(TRIM(C8),\" \",\"\"))+1)","v":0}]
[null,3,null,null,null,null,0]
[null,4,null,null,null,null,0]
{"$rows_left_out":29}